{"text_format":"1","workbook":"xlsx","n_sheets":11,"sheets":["Instructions","MCC Data Input","MCC Comparison Summary","APR Calculations","Recapture Calculator","2010 Tax Table and deducts","MCC Disclosure","MCC Transmittal","MCC Recapture Notice","MCC Application Affidavit","Sheet1"],"not_rendered":{"charts":1,"images":11,"macros":1,"external_links":0,"defined_names":8,"comments":0,"pivot_tables":0},"unopened":[],"bounds":{"document_bytes":16777216,"sheet_cells":100000,"rows_first":2000,"rows_last":500,"rows_between":2000,"halvings":0,"cell_chars":16384,"cell_head_chars":4096},"cells_cut":0,"cells_raw":0,"read":"whole","date_system":"1900"}

{"sheet":"Instructions","index":0,"n_rows":130,"n_cols":9,"rows_kept":130,"cut":false,"hidden":false,"merged":[[120,1,120,10],[6,2,6,10],[8,2,8,10],[2,0,2,10],[12,1,12,10],[14,1,14,10],[24,1,24,10],[41,1,41,10],[65,1,65,10],[63,1,63,10],[84,1,84,10],[103,1,103,10]]}
["CITY OF PORTLAND - MCC PROGRAM CALCULATOR INSTRUCTIONS"]
[]
["This Mortgage Credit Certificate (MCC) Comparison Spreadsheet is designed to help MCC Certified Loan Officers evaluate whether the MCC Program is the right product for their clients. The information provided is estimates only and requires the skill of a lending professional to evaluate and interpret the resulting outputs.  It is not intended for use by the general public. For more information about the City of Portland's MCC program and the eligibility requirements, please visit www.pdc.us/mcc."]
[]
["PURPOSE OF THIS WORKBOOK"]
[]
[null,"1.","To help MCC Certified Loan Officers evaluate whether the MCC program is the best product for their clients; and"]
[]
[null,"2.","To facilitate completion of the unique MCC forms that PDC requires prior to issuing an MCC Commitment"]
[]
["GETTING STARTED"]
[]
[null,"This workbook uses macros to automate the spreadsheet and make it easier to print the individual forms and disclosures required for submission of an application to PDC for approval.  Your system must be set to allow macros to run on your computer for these functions to work properly on your computer. "]
[]
[null,"When you first open this workbook, you will likely see a security warning at the bottom of the ribbon. Click \"Options\" to move to the screen that will allow you to enable macros. "]
[]
[]
[]
[]
[]
[]
[]
[]
[]
[null,"You should now see a screen similar the one below.  Click \"Enable this Content\" and then click \"OK\". This will enable macros and take you to the beginning of the MCC Data Input worksheet."]
[]
[]
[]
[]
[]
[]
[]
[]
[]
[]
[]
[]
[]
[]
["MCC DATA INPUT"]
[]
[null,"The MCC Data Input worksheet is where you will enter all of the information needed to complete the comparison and populate the various MCC disclosure and submission forms.  This is the only worksheet where input is allowed.  All of the other forms are populated based upon what you input here.  So, if you see a mistake on any of the forms, this is likely where the error originated.  "]
[]
[null,"Note that many fields include drop down boxes that limit your input options for that field."]
[]
[]
[]
[]
[]
[]
[]
[]
[]
[]
[]
[]
[]
[]
[]
[]
[]
["VIEWING OPTIONS"]
[]
[null,"You may find it helpful to view the MCC Data Input worksheet at the same time as you are reviewing the MCC Comparison Summary or the MCC Disclosure to evaluate how changing different input fields affects qualifying and tax impacts. "]
[]
[null,"To view worksheets side by side go to \"View\" on the ribbon, under the windows category click \"New Window\".  This should activate the \"View side by side\" option, click \"View side by side\" and then click on the tab for the second worksheet you want to view.  "]
[]
[]
[]
[]
[]
[]
[]
[]
[]
[]
[]
[]
[]
[]
[]
[]
[]
[]
[null,"This will activate the second worksheet on the screen and your window will look something like this."]
[]
[]
[]
[]
[]
[]
[]
[]
[]
[]
[]
[]
[]
[]
[]
[]
[]
[]
[null,"To change the order in which the pages are displayed you can click \"Arrange All\" to set the view screen horizontally, vertically tiled, or cascade.  Also note that movement of the screens will be synchronized when you first set-up the side by side viewing.  To turn synchronization off, just click \"Synchronous Scrolling\" in the Windows section."]
[]
[]
[]
[]
[]
[]
[]
[]
[]
[]
[]
[]
[]
[]
["PRINTING THE FORMS"]
[]
[null,"The workbook has been designed to automatically print each of the unique MCC forms and disclosures that are required for submission of an MCC application package to PHB for approval.  You can print all of the forms at one time, or select individual forms for printing.  Remember that the information from the MCC Data Input worksheet drives the information that will populate all of the other forms.  If you notice an error in the printed form, it likely was caused by an error on the MCC Data Input form."]
[]
[null,null,"To print form:",null,null,null,"Enter",null,"# of Pages"]
[null,null,"MCC Data Input",null,null,null,"Ctrl+Shift+A",null,4]
[null,null,"MCC Summary",null,null,null,"Ctrl+Shift+B",null,2]
[null,null,"MCC Disclosure",null,null,null,"Ctrl+Shift+C",null,5]
[null,null,"MCC Transmittal",null,null,null,"Ctrl+Shift+D",null,1]
[null,null,"MCC Recapture Notice",null,null,null,"Ctrl+Shift+E",null,1]
[null,null,"MCC Application Affidavit",null,null,null,"Ctrl+Shift+F",null,5]
[null,null,"All",null,null,null,"Ctrl+Shift+G",null,{"$f":"SUM(I124:I129)","v":18}]

{"sheet":"MCC Data Input","index":1,"n_rows":173,"n_cols":8,"rows_kept":173,"cut":false,"hidden":false,"merged":[[11,4,11,6],[135,4,135,6],[136,4,136,6],[81,0,81,2],[14,4,14,6],[39,4,39,6],[94,4,94,6],[132,4,132,6],[133,4,133,6],[129,4,129,6],[128,4,128,6],[130,4,130,6],[131,4,131,6],[134,4,134,6],[125,4,125,6],[102,4,102,6],[9,4,9,6],[10,4,10,6],[12,4,12,6],[13,4,13,6],[38,4,38,6],[24,0,24,8],[37,0,37,8],[34,1,34,2],[19,4,19,6],[26,4,26,8],[27,4,27,8],[16,4,16,6],[17,4,17,6],[18,4,18,6],[21,4,21,6],[22,4,22,6],[7,4,7,6],[8,4,8,6],[0,0,0,8],[1,0,1,8],[5,0,5,8],[2,6,2,8],[3,0,3,8],[127,0,127,8],[103,4,103,6],[104,4,104,6],[105,4,105,6],[107,4,107,6],[108,4,108,6],[123,4,123,6],[124,4,124,6],[96,4,96,6],[95,4,95,6],[52,0,52,8],[73,0,73,8],[122,4,122,6],[112,4,112,6],[113,4,113,6],[114,4,114,6],[115,4,115,6],[117,4,117,6],[118,4,118,6],[97,4,97,6],[98,4,98,6],[41,1,41,2],[38,1,38,2],[93,0,93,8],[80,0,80,8],[43,1,43,2],[44,1,44,2],[42,1,42,2],[33,6,33,8],[15,4,15,6],[20,4,20,6],[39,1,39,2],[40,1,40,2]]}
["Mortgage Credit Certificate Program"]
["Product Comparison Data Input"]
[null,null,null,null,null,null,{"$f":"IF('MCC Comparison Summary'!E16=\"OVER INCOME\",\"OVER INCOME\",\" \")","v":" "}]
["* Field required to complete pre-qualification comparison.  However, all fields must be completed to properly populate forms required for submission to PHB for commitment."]
[]
["LENDER INFORMATION"]
["Disclosure Date",null,null,"*"]
["Lender",null,null,"*"]
["Loan Number"]
["Loan Officer",null,null,"*"]
["Loan Officer Contact Information",null,null,null,null,null,null,"Business Phone"]
[null,null,null,null,null,null,null,"Cell Phone"]
[null,null,null,null,null,null,null,"Fax Number"]
[null,null,null,null,null,null,null,"Email Address"]
[null,null,null,null,null,null,null,"Mailing Address"]
[null,null,null,null,null,null,null,"City/State/Zip"]
["Loan Processor"]
["Loan Processor Contact Information",null,null,null,null,null,null,"Business Phone"]
[null,null,null,null,null,null,null,"Cell Phone"]
[null,null,null,null,null,null,null,"Fax Number"]
[null,null,null,null,null,null,null,"Email Address"]
[null,null,null,null,null,null,null,"Mailing Address"]
[null,null,null,null,null,null,null,"City/State/Zip"]
[]
["BORROWER GENERAL INFORMATION"]
["General Information"]
[null,"Applicant Name (legal name)",null,"*"]
[null,"Co-Applicant Name (legal name)",null,"*"]
[null,"Total # of People in Household",null,"*"]
[null,"Homebuyer(s) Gross Annual Income",null,"*"]
["Homebuyer Tax Filing Information"]
[null,"IRS Filing Status (check only 1 filing status)",null,"*"]
[null,"# of Dependent Children under 17",null,"*"]
[null,"# of \"Other\" Dependents (for tax purposes)",null,"*",null,null,"(to add unmarried co-borrower add 1 \"other dependent\" here)"]
[null,"Other Tax Deductions (excluding property taxes and mortgage insurance)",null,"*"]
[null,"Other Tax Credit (if any)",null,"*",null,null,"(not including 1st time homebuyer credit)"]
[]
["PURCHASE/PROPERTY INFORMATION"]
[null,"Property Address",null,null,null,null,null," "]
[null,"City/State/Zip"]
[null,"Property is located in Target Area",null,null,"No"]
[null,"Type of Construction"]
[null,"If New Construction, has construction been completed?"]
[null,"If incomplete, est. cost to finish construction",null," "]
[null,null,null,null,"Bond Program",null,"Bank Loan"]
[null,"Sales Price",null,"*"]
[null,"Down Payment (as a %)",null,"*",null,"*"]
[null,"Monthly Property Tax Estimate",null,"*",null," ",{"$f":"E48","v":0}]
[null,"Monthly Hazard Insurance",null,"*",null,null,{"$f":"E49","v":0}]
[null,"Estimated HOA Dues",null,"*",null,null,{"$f":"E50","v":0}]
[null,"Calculated Loan Amount (w/o MIP)",null," ",{"$f":"$E$46-($E$46*E47)-(E66*E71)","v":0}," ",{"$f":"$E$46-($E$46*G47)-(G66*G71)","v":0}]
[null,null,null," "]
["FINANCING INFORMATION"]
[null,"First Mortgage Info",null,null,"Bond Program",null,"Bank Loan"]
[null,"Note Rate",null,"*",null,"*"]
[null,"Up-front FHA Mortgage Insurance",null,"*",null,"*"]
[null,"Monthly Mortgage Insurance Rate",null,"*",null,"*"]
[null,"Loan Term",null,"*",null,"years"]
[]
[null,"Loan Origination Fee (%)",null,"*",null,"*"]
[null,"Other Financing Charges (APR)",null,"*",null,"*"]
[null,"MCC Fee",null,null,null,null,675]
[null,"Reserve Deposits with Lender",null,"*",null,"*"]
[null,"3rd Party Fees (Non APR)",null,"*",null,"*"]
[null,"Second Mortgage"]
[null,"Amount of 2nd mortgage",null,"*",0,"*",0]
[null,"2nd Mortgage Interest Rate",null,"*",null,"*"]
[null,"Term of 2nd mortgage (in years)",null,"*",null,"*",null,"yrs"]
[null,"Second Mortgage Loan Fees",null,"*",0,"*",0]
[null,"Are Payment Required on 2nd mtg?",null,"*",null,"*"]
[null,"% of 2nd mtg proceeds used for purchase",null,"*",null,"*"]
[null,"% of 2nd mtg to Home Impr.Fund",null,null,{"$f":"(1-E71)","v":1},null,{"$f":"(1-G71)","v":1}]
[]
["RECAPTURE ESTIMATOR"]
[null,"Number of years you expect to own this home",null,null,null,"*"]
[null,"Homebuyer(s) estimated annual income at sale",null,null,null,"*"]
[null,"Estimated household size at sale",null,null,null,"*"]
[null,"Estimated annual appreciation ",null,null,null,"*"]
[null,"Estimated costs of sale",null,null,null,"*"]
[]
["BORROWER DEMOGRAPHIC INFORMATION (check all that apply)"]
[null,null,null,null,"Borrower",null,"Co-Borrower"]
[null,"Gender"]
[null,"Race"]
[null,null,"American Indian/Alaska Native",null,"No",null,"No"]
[null,null,"Asian",null,"No",null,"No"]
[null,null,"Black or African American",null,"No",null,"No"]
[null,null,"Native Hawaiian/Pacific Islander",null,"No",null,"No"]
[null,null,"White",null,"No",null,"No"]
[null,null,"Other",null,"No",null,"No"]
[null,"Ethnicity"]
[null,"US Citizen"]
[]
["BORROWER CURRENT AND PRIOR RESIDENCY HISTORY (3 year history)"]
[null,"Borrower Contact Info",null,null,null,null,null,"Home Phone"]
[null,null,null,null,null,null,null,"Work Phone"]
[null,null,null,null,null,null,null,"Email address"]
[null,null,null,null,null,null,null,"Current Address"]
[null,null,null,null,null,null,null,"City/State/Zip"]
[null,null,"Own/Rent",null,"Rent"]
[null,null,null,null,"Beginning Date",null,"Ending Date"]
[null,null,"Length of Residency"]
[null,"Landlord Contact Info",null,null,null,null,null,"Name"]
[null,null,null,null,null,null,null,"Address"]
[null,null,null,null,null,null,null,"City/State/Zip"]
[null,null,null,null,null,null,null,"Phone Number"]
[]
[null,"Previous Address (1)",null,null,null,null,null,"Mailing Address"]
[null,null,null,null,null,null,null,"City/State/Zip"]
[null,null,"Own/Rent",null,"Rent"]
[null,null,null,null,"Beginning Date",null,"Ending Date"]
[null,null,"Length of Residency"]
[null,"Prior Landlord Contact Info (1)",null,null,null,null,null,"Name"]
[null,null,null,null,null,null,null,"Address"]
[null,null,null,null,null,null,null,"City/State/Zip"]
[null,null,null,null,null,null,null,"Phone Number"]
[]
[null,"Previous Address (2)",null,null,null,null,null,"Mailing Address"]
[null,null,null,null,null,null,null,"City/State/Zip"]
[null,null,"Own/Rent",null,"Rent"]
[null,null,null,null,"Beginning Date",null,"Ending Date"]
[null,null,"Length of Residency"]
[null,"Prior Landlord Contact Info (2)",null,null,null,null,null,"Name"]
[null,null,null,null,null,null,null,"Address"]
[null,null,null,null,null,null,null,"City/State/Zip"]
[null,null,null,null,null,null,null,"Phone Number"]
[]
["ESCROW INFORMATION"]
["Escrow Company"]
["Escrow Number"]
["Estimated Closing Date"]
["Escrow Agent"]
["Escrow Contact Info",null,null,null,null,null,null,"Phone"]
[null,null,null,null,null,null,null,"Fax Number"]
[null,null,null,null,null,null,null,"Email Address"]
[null,null,null,null,null,null,null,"Mailing Address"]
[null,null,null,null,null,null,null,"City/State/Zip"]
[]
[]
[]
[]
[]
[]
[]
[]
[]
[]
[]
[]
["Drop Down Box Data"]
[]
["Yes"]
["No"]
[]
["has"]
["has not"]
[]
["Own"]
["Rent"]
["NA"]
[]
["Existing"]
["New Construction"]
[]
["Male"]
["Female"]
[]
["Married filing Jointly"]
["Single"]
["Head of Household"]
[]
["Hispanic/Latino"]
["Non-Hispanic/Latino"]

{"sheet":"MCC Comparison Summary","index":2,"n_rows":79,"n_cols":7,"rows_kept":79,"cut":false,"hidden":false,"merged":[[3,2,3,3],[7,2,7,4],[6,0,6,1],[5,2,5,4],[0,0,0,4],[3,0,3,1],[4,2,4,3],[1,0,1,4],[78,0,78,4],[73,0,73,1],[59,0,59,1],[16,0,16,1],[9,0,9,1],[48,0,48,1],[27,0,27,1],[43,0,43,1],[33,0,33,1],[71,0,71,1]]}
["City of Portland Mortgage Credit Certificate Program"]
["Loan Product Comparison"]
[]
["Applicant(s) Name",null,"Disclosure Date"]
[null,{"$f":"'MCC Data Input'!E27","v":0},{"$f":"'MCC Data Input'!E7","v":"00:00:00"}]
[null,{"$f":"IF('MCC Data Input'!E28>0,+'MCC Data Input'!E28,\" \")","v":" "},{"$f":"IF(E16=\"OVER INCOME\",\"OVER INCOME\",\" \")","v":" "}]
["Lender Name",null,"Prepared By:"]
[null,{"$f":"'MCC Data Input'!E8","v":0},{"$f":"'MCC Data Input'!E10","v":0}]
[]
["HOMEBUYER INFORMATION",null,"Oregon Bond","Traditional Loan","MCC"]
[1,"IRS Filing Status",{"$f":"+'MCC Data Input'!E32","v":0},{"$f":"C11","v":0},{"$f":"C11","v":0}]
[{"$f":"A11+1","v":2},"Number of  Exemptions for Income Tax Purposes",{"$f":"IF(C11=\"MARRIED FILING JOINTLY\",2, 1)","v":1},{"$f":"+C12","v":1},{"$f":"+C12","v":1}]
[{"$f":"A12+1","v":3},"Number of Children Under 17",{"$f":"'MCC Data Input'!E33","v":0},{"$f":"+C13","v":0},{"$f":"+C13","v":0}]
[{"$f":"A13+1","v":4},"Other Dependents for Income Tax Purposes",{"$f":"'MCC Data Input'!E34","v":0},{"$f":"C14","v":0},{"$f":"D14","v":0}]
[{"$f":"A14+1","v":5},"Family Size",{"$f":"C14+C13+C12","v":1},{"$f":"D14+D13+D12","v":1},{"$f":"E14+E13+E12","v":1}]
[{"$f":"A15+1","v":6},{"$f":"'MCC Data Input'!B30","v":"Homebuyer(s) Gross Annual Income"},{"$f":"IF('MCC Data Input'!E30>'Recapture Calculator'!D38,\"OVER INCOME\",+'MCC Data Input'!E30)","v":0},{"$f":"'MCC Data Input'!E30","v":0},{"$f":"IF('MCC Data Input'!E30>'Recapture Calculator'!D37,\"OVER INCOME\",+'MCC Data Input'!E30)","v":0},"MCC","Bond"]
["SALE AND FIRST MORTGAGE LOAN ASSUMPTIONS",null,{"$f":"$C$10","v":"Oregon Bond"},{"$f":"$D$10","v":"Traditional Loan"},{"$f":"$E$10","v":"MCC"}]
[{"$f":"A16+1","v":7},"Sales Price",{"$f":"'MCC Data Input'!E46","v":0},{"$f":"$C18","v":0},{"$f":"$C18","v":0}]
[{"$f":"A18+1","v":8},"Amount of Second Mortgage used for Purchase",{"$f":"C29*'MCC Data Input'!E71","v":0},{"$f":"'MCC Data Input'!G66*'MCC Data Input'!G71","v":0},{"$f":"D19","v":0}]
[9,"Borrower Down Payment",{"$f":"C18*'MCC Data Input'!E47","v":0},{"$f":"D18*'MCC Data Input'!G47","v":0},{"$f":"D20","v":0}]
[10,"FHA Upfront MIP",{"$f":"'MCC Data Input'!E56","v":0},{"$f":"'MCC Data Input'!G56","v":0},{"$f":"D21","v":0}]
[{"$f":"A21+1","v":11},"First Mortgage Loan Amount (incl. up front MI on FHA loans)",{"$f":"C18-C19-C20+C21","v":0},{"$f":"D18-D19-D20+D21","v":0},{"$f":"E18-E19-E20+E21","v":0}]
[12,"First Mortgage Note Rate",{"$f":"'MCC Data Input'!E55","v":0},{"$f":"'MCC Data Input'!G55","v":0},{"$f":"D23","v":0}]
[13,"Monthly Mortgage Insurance Premium Rate",{"$f":"'MCC Data Input'!E57","v":0},{"$f":"'MCC Data Input'!G57","v":0},{"$f":"D24","v":0}]
[14,"Loan Term (years)",{"$f":"'MCC Data Input'!E58","v":0},{"$f":"C25","v":0},{"$f":"D25","v":0}]
[15,"Annual Interest (1st year)",{"$f":"C22*C23","v":0},{"$f":"D22*D23","v":0},{"$f":"E22*E23","v":0}]
[16,"MCC Credit (20% of 1st year interest)",4.9999999999999998E-7,5.0000000000000004E-6,{"$f":"E26*0.2","v":0}]
["SECOND MORTGAGE LOAN ASSUMPTIONS",null,{"$f":"$C$10","v":"Oregon Bond"},{"$f":"$D$10","v":"Traditional Loan"},{"$f":"$E$10","v":"MCC"}]
[{"$f":"A27+1","v":17},"Amount of Second Mortgage",{"$f":"'MCC Data Input'!E66","v":0},{"$f":"'MCC Data Input'!G66","v":0},{"$f":"D29","v":0}]
[{"$f":"A29+1","v":18},"Amt of 2nd Mtg deposited in Home Improvement Fund",{"$f":"C29*'MCC Data Input'!E72","v":0},{"$f":"'MCC Data Input'!G66*'MCC Data Input'!G72","v":0},{"$f":"D30","v":0}]
[{"$f":"A30+1","v":19},"Second Mortgage Interest Rate",{"$f":"'MCC Data Input'!E67","v":0},{"$f":"'MCC Data Input'!G67","v":0},{"$f":"D31","v":0}]
[{"$f":"A31+1","v":20},"Second Mortgage Loan Term",{"$f":"'MCC Data Input'!E68","v":0},{"$f":"'MCC Data Input'!G68","v":0},{"$f":"D32","v":0}]
[{"$f":"A32+1","v":21},"Are Payments Required on Second Mortgage?",{"$f":"'MCC Data Input'!E70","v":0},{"$f":"'MCC Data Input'!G70","v":0},{"$f":"D33","v":0}]
["MONTHLY PAYMENT COMPARISON",null,{"$f":"$C$10","v":"Oregon Bond"},{"$f":"$D$10","v":"Traditional Loan"},{"$f":"$E$10","v":"MCC"}]
[{"$f":"A33+1","v":22},"First Mortgage Principal and Interest",{"$f":"-PMT(C23,C25,C22)/12","v":{"$error":"#DIV/0!"}},{"$f":"-PMT(D23,D25,D22)/12","v":{"$error":"#DIV/0!"}},{"$f":"-PMT(E23,E25,E22)/12","v":{"$error":"#DIV/0!"}}]
[{"$f":"A35+1","v":23},"Second Mortgage Principal and Interest",{"$f":"IF(C33=\"Yes\",-PMT(C31/12,C32*12,C29),0)","v":0},{"$f":"IF(D33=\"Yes\",-PMT(D31/12,D32*12,D29),0)","v":0},{"$f":"IF(E33=\"Yes\",-PMT(E31/12,E32*12,E29),0)","v":0}]
[24,"Estimated Monthly Property Taxes",{"$f":"'MCC Data Input'!$E$48","v":0},{"$f":"'MCC Data Input'!$E$48","v":0},{"$f":"'MCC Data Input'!$E$48","v":0}]
[25,"Estimated Monthly Hazard Insurance Premium",{"$f":"IF(C40=0,+'MCC Data Input'!$E$49,0)","v":0},{"$f":"IF(D40=0,+'MCC Data Input'!$E$49,0)","v":0},{"$f":"IF(E40=0,+'MCC Data Input'!$E$49,0)","v":0}]
[26,"Estimated Monthly Mortgage Insurance",{"$f":"C22*C24/12","v":0},{"$f":"D22*D24/12","v":0},{"$f":"E22*E24/12","v":0}]
[27,"Homeowners Association Dues",{"$f":"'MCC Data Input'!E50","v":0},{"$f":"C40","v":0},{"$f":"D40","v":0}]
[28,"Total Monthly Mortgage Payment",{"$f":"SUM(C35:C40)","v":{"$error":"#DIV/0!"}},{"$f":"SUM(D35:D40)","v":{"$error":"#DIV/0!"}},{"$f":"SUM(E35:E40)","v":{"$error":"#DIV/0!"}}]
[29,"Maximum Monthly MCC Tax Credit",0,0,{"$f":"-E27/12","v":0}]
[30,"Net Effective Monthly Payment",{"$f":"C41+C42","v":{"$error":"#DIV/0!"}},{"$f":"D41+D42","v":{"$error":"#DIV/0!"}},{"$f":"E41+E42","v":{"$error":"#DIV/0!"}}]
["FIRST MORTGAGE APR COMPARISON",null,{"$f":"$C$10","v":"Oregon Bond"},{"$f":"$D$10","v":"Traditional Loan"},{"$f":"$E$10","v":"MCC"}]
[{"$f":"A43+1","v":31},"Estimated Annual Percentage Rate (APR) at closing",{"$f":"'APR Calculations'!C20","v":{"$error":"#NUM!"}},{"$f":"'APR Calculations'!D20","v":{"$error":"#NUM!"}},{"$f":"'APR Calculations'!E20","v":{"$error":"#NUM!"}}]
[{"$f":"A45+1","v":32},"Eff. Interest Rate if MCC is used for only 9 years (but runs 30 yrs)",null,null,{"$f":"'APR Calculations'!E21","v":{"$error":"#NUM!"}}]
[{"$f":"A46+1","v":33},"Eff. Interest Rate if MCC is used full 30 year term",null,null,{"$f":"'APR Calculations'!E22","v":{"$error":"#NUM!"}}]
[{"$f":"A47+1","v":34},"Eff. Int. Rate if IRS form 8396 is not filed with federal tax returns",null,null,{"$f":"E45","v":{"$error":"#NUM!"}}]
["LOAN FEES",null,{"$f":"$C$10","v":"Oregon Bond"},{"$f":"$D$10","v":"Traditional Loan"},{"$f":"$E$10","v":"MCC"}]
[{"$f":"A47+1","v":34},"Loan Origination Fee (% of loan amount)",{"$f":"'MCC Data Input'!E60","v":0},{"$f":"'MCC Data Input'!G60","v":0},{"$f":"D50","v":0}]
[{"$f":"A50+1","v":35},"Loan Origination Fee ($ amount)",{"$f":"C22*C50","v":0},{"$f":"D22*D50","v":0},{"$f":"E22*E50","v":0}]
[36,"Other Prepaid Finance Charges (excluding Loan Orig. Fee)",{"$f":"'MCC Data Input'!E61","v":0},{"$f":"'MCC Data Input'!G61","v":0},{"$f":"D52","v":0}]
[37,"Prepaid/Reserves Deposited with Lender",{"$f":"'MCC Data Input'!E63","v":0},{"$f":"'MCC Data Input'!G63","v":0},{"$f":"D53","v":0}]
[38,"MCC Fee",0,0,{"$f":"'MCC Data Input'!G62","v":675}]
[39,"3rd Party Fees",{"$f":"'MCC Data Input'!E64","v":0},{"$f":"'MCC Data Input'!G64","v":0},{"$f":"D55","v":0}]
[40,"Second Mortgage Loan Fees",{"$f":"'MCC Data Input'!E69","v":0},{"$f":"'MCC Data Input'!G69","v":0},{"$f":"D56","v":0}]
[41,"Total Loan Fees",{"$f":"SUM(C51:C56)","v":0},{"$f":"SUM(D51:D56)","v":0},{"$f":"SUM(E51:E56)","v":675}]
[42,"Down Payment from borrowers own funds",{"$f":"C20","v":0},{"$f":"D20","v":0},{"$f":"E20","v":0}]
[43,"Total Estimated Cost to Close",{"$f":"C57+C58","v":0},{"$f":"D57+D58","v":0},{"$f":"E57+E58","v":675}]
["FEDERAL TAX ESTIMATE 1., 2.",null,{"$f":"$C$10","v":"Oregon Bond"},{"$f":"$D$10","v":"Traditional Loan"},{"$f":"$E$10","v":"MCC"}]
[{"$f":"A59+1","v":44},"Gross Annual Income",{"$f":"+C16","v":0},{"$f":"+D16","v":0},{"$f":"+E16","v":0}]
[{"$f":"A61+1","v":45},"Less Interest, Property Tax and Mortgage Insurance Deductions",{"$f":"-C26-(C37*12)-(C39*12)","v":0},{"$f":"-D26-(D37*12)-(D39*12)","v":0},{"$f":"-E26*0.8-(E37*12)-(E39*12)","v":0}]
[46,"Less IRS Exemptions",{"$f":"-C15*'2010 Tax Table and deducts'!$G$2","v":-3650},{"$f":"-D15*'2010 Tax Table and deducts'!$G$2","v":-3650},{"$f":"-E15*'2010 Tax Table and deducts'!$G$2","v":-3650}]
[47,"Other Deductions",{"$f":"-'MCC Data Input'!E35","v":0},{"$f":"+C64","v":0},{"$f":"+C64","v":0}]
[48,"Estimated Taxable Income",{"$f":"IF(C61=\"OVER INCOME\",\"OVER INCOME\",SUM(C61:C64))","v":-3650},{"$f":"IF(D61=\"OVER INCOME\",\"OVER INCOME\",SUM(D61:D64))","v":-3650},{"$f":"IF(E61=\"OVER INCOME\",\"OVER INCOME\",SUM(E61:E64))","v":-3650}]
[49,"2010 Tax Liability from Calculator",{"$f":"IF((C11=\"SINGLE\"),+'2010 Tax Table and deducts'!C2,IF((C11=\"MARRIED FILING JOINTLY\"),+'2010 Tax Table and deducts'!C3,IF((C11=\"HEAD OF HOUSEHOLD\"),+'2010 Tax Table and deducts'!C4)))","v":false},{"$f":"IF((D11=\"SINGLE\"),+'2010 Tax Table and deducts'!D2,IF((D11=\"MARRIED FILING JOINTLY\"),+'2010 Tax Table and deducts'!D3,IF((D11=\"HEAD OF HOUSEHOLD\"),+'2010 Tax Table and deducts'!D4)))","v":false},{"$f":"IF((E11=\"SINGLE\"),+'2010 Tax Table and deducts'!E2,IF((E11=\"MARRIED FILING JOINTLY\"),+'2010 Tax Table and deducts'!E3,IF((E11=\"HEAD OF HOUSEHOLD\"),+'2010 Tax Table and deducts'!E4)))","v":false}]
[50,"Estimate Child Tax Credit",{"$f":"-C13*'2010 Tax Table and deducts'!$G$3","v":0},{"$f":"-D13*'2010 Tax Table and deducts'!$G$3","v":0},{"$f":"-E13*'2010 Tax Table and deducts'!$G$3","v":0}]
[51,"Other Tax Credits (enter as a negative figure)",{"$f":"-'MCC Data Input'!E36","v":0},{"$f":"C68","v":0},{"$f":"D68","v":0}]
[52,"Estimated Tax Liability (Before MCC)",{"$f":"IF(SUM(C66:C68)>0,SUM(C66:C68),0)","v":0},{"$f":"IF(SUM(D66:D68)>0,SUM(D66:D68),0)","v":0},{"$f":"IF(SUM(E66:E68)>0,SUM(E66:E68),0)","v":0}]
[53,"Less VALUE OF MCC Tax Credit (based on anticipated tax liability)",0,0,{"$f":"-IF(E27<E69,E27,E69)","v":0}]
[54,"ESTIMATED Net Fed income Tax Owed 2.3.",{"$f":"SUM(C69:C70)","v":0},{"$f":"SUM(D69:D70)","v":0},{"$f":"SUM(E69:E70)","v":0}]
["ESTIMATED RECAPTURE TAX 4.",null,{"$f":"$C$10","v":"Oregon Bond"},{"$f":"$D$10","v":"Traditional Loan"},{"$f":"$E$10","v":"MCC"}]
[{"$f":"A71+1","v":55},"Estimated Recapture Tax (only applies if sold within 9 years of purchase)",{"$f":"'Recapture Calculator'!G31","v":{"$error":"#N/A"}},0,{"$f":"'Recapture Calculator'!F31","v":{"$error":"#N/A"}}]
["NET HOUSING EXPENSE",null,{"$f":"$C$10","v":"Oregon Bond"},{"$f":"$D$10","v":"Traditional Loan"},{"$f":"$E$10","v":"MCC"}]
[{"$f":"A73+1","v":56},"Total Annual PITIMI Payment",{"$f":"C41*12","v":{"$error":"#DIV/0!"}},{"$f":"D41*12","v":{"$error":"#DIV/0!"}},{"$f":"E41*12","v":{"$error":"#DIV/0!"}}]
[{"$f":"A75+1","v":57},"Less MCC Credit",0,0,{"$f":"E70","v":0}]
[{"$f":"A76+1","v":58},"Net Housing Expense-PITI ( AFTER MCC)",{"$f":"SUM(C75:C76)","v":{"$error":"#DIV/0!"}},{"$f":"SUM(D75:D76)","v":{"$error":"#DIV/0!"}},{"$f":"SUM(E75:E76)","v":{"$error":"#DIV/0!"}}]
[]
["Notes: 1. 2010 Federal Tax Tables X, Y-1 and Z - Source: http://www.irs.gov.     2.  Income and property taxes used here are ESTIMATES ONLY. Consult with a tax professional to review your individual circumstances.     3. MCC Line 52 cannot be LESS than Zero--MCC is NOT a \"refundable\" credit. 4. Recapture Tax estimate is based upon future income and sales assumptions provided by homebuyer."]

{"sheet":"APR Calculations","index":3,"n_rows":391,"n_cols":27,"rows_kept":391,"cut":false,"hidden":true,"merged":[]}
["APR analysis",null,"Bond","Market","MCC"]
["Loan Amount",null,{"$f":"E2","v":0},{"$f":"C2","v":0},{"$f":"'MCC Comparison Summary'!C22","v":0}]
["Interest Rate",null,{"$f":"'MCC Comparison Summary'!C23","v":0},{"$f":"'MCC Comparison Summary'!D23","v":0},{"$f":"D3","v":0}]
["Mortgage Insurance Rate",null,{"$f":"'MCC Comparison Summary'!C24","v":0},{"$f":"'MCC Comparison Summary'!D24","v":0},{"$f":"'MCC Comparison Summary'!E24","v":0}]
["Term",null,{"$f":"E5","v":360},{"$f":"C5","v":360},360]
["Monthly P&I Pmt",null,{"$f":"-PMT(C3/12,C5,C2)","v":0},{"$f":"-PMT(D3/12,D5,D2)","v":0},{"$f":"-PMT(E3/12,E5,E2)","v":0}]
["Mortgage Insurance Premium",null,{"$f":"'MCC Comparison Summary'!C39","v":0},{"$f":"'MCC Comparison Summary'!D39","v":0},{"$f":"'MCC Comparison Summary'!E39","v":0}]
["Total PIMI Pmt",null,{"$f":"SUM(C6:C7)","v":0},{"$f":"SUM(D6:D7)","v":0},{"$f":"SUM(E6:E7)","v":0}]
[]
["Points - %",null,{"$f":"'MCC Comparison Summary'!C50","v":0},{"$f":"'MCC Comparison Summary'!D50","v":0},{"$f":"'MCC Comparison Summary'!D50","v":0}]
["Points - $",null,{"$f":"C2*C10","v":0},{"$f":"D2*D10","v":0},{"$f":"E2*E10","v":0}]
["Other Finance Charges",null,{"$f":"'MCC Comparison Summary'!C52","v":0},{"$f":"'MCC Comparison Summary'!D52","v":0},{"$f":"'MCC Comparison Summary'!E52+'MCC Comparison Summary'!E54","v":675}]
["Total Prepaid Finance Charges",null,{"$f":"SUM(C11:C12)","v":0},{"$f":"SUM(D11:D12)","v":0},{"$f":"SUM(E11:E12)","v":675}]
["Amount Financed",null,{"$f":"C2-C13","v":0},{"$f":"D2-D13","v":0},{"$f":"E2-E13","v":-675}]
["Mortgage Insurance (125 mos)",null,{"$f":"(($C$2*$C$4)/12)*125","v":0},{"$f":"(($D$2*$D$4)/12)*125","v":0},{"$f":"(($E$2*$E$4)/12)*125","v":0}]
["Mortgage Interest Paid",null,{"$f":"D27","v":0},{"$f":"J27","v":0},{"$f":"P27","v":0}]
["Total Finance Charge",null,{"$f":"C13+C15+C16","v":0},{"$f":"D13+D15+D16","v":0},{"$f":"E13+E15+E16","v":675}]
["Total Payments",null,{"$f":"C17+C2-C13","v":0},{"$f":"D17+D2-D13","v":0},{"$f":"E17+E2-E13","v":0}]
["MCC Credit ",null,0,null,0.2]
["APR",null,{"$f":"RATE(C5,(((-C8*125)+(-C6*235))/360),(C2-C13))*12","v":{"$error":"#NUM!"}},{"$f":"RATE(D5,(((-D8*125)+(-D6*235))/360),(D2-D13))*12","v":{"$error":"#NUM!"}},{"$f":"RATE($E$5,(((-$E$8*125)+(-$E$6*235))/360),($E$2-$E$13))*12","v":{"$error":"#NUM!"}},"Ave. Mo MCC"]
["Eff. Int. Rate =9 years MCC useage",null,null,null,{"$f":"RATE($E$5,((((-$E$8*125)+(-$E$6*235)+(F21*108)))/360),($E$2-$E$13))*12","v":{"$error":"#NUM!"}},{"$f":"H21/108","v":0},"tax credits",{"$f":"SUM(R28:R135)","v":0},"Over period"]
["Eff. Int. Rate =30 years MCC useage",null,null,null,{"$f":"RATE($E$5,((((-$E$8*125)+(-$E$6*235)+(F22*360)))/360),($E$2-$E$13))*12","v":{"$error":"#NUM!"}},{"$f":"H22/360","v":0},"tax credits",{"$f":"R27","v":0}]
[]
[]
["Bond",null,null,null,null,null,"Market",null,null,null,null,null,"MCC Amortization Schedule"]
[null,"Beg Bal","Prin","Interest","Ending Bal",null,null,"Beg Bal","Prin","Interest","Ending Bal",null,null,"Beg Bal","Prin","Interest","Ending Bal","MCC Credit","Effective Interest Cost"]
["Totals",null,{"$f":"SUM(C28:C387)","v":0},{"$f":"SUM(D28:D387)","v":0}," ","LTV","Totals",null,{"$f":"SUM(I28:I387)","v":0},{"$f":"SUM(J28:J387)","v":0}," ",null,"Totals",null,{"$f":"SUM(O28:O387)","v":0},{"$f":"SUM(P28:P387)","v":0}," ",{"$f":"SUM(R28:R387)","v":0},{"$f":"SUM(S28:S387)","v":0}]
[1,{"$f":"$C$2","v":0},{"$f":"$C$6-D28","v":0},{"$f":"B28*$C$3/12","v":0},{"$f":"B28-C28","v":0},{"$f":"E28/$C$2","v":{"$error":"#DIV/0!"}},1,{"$f":"$D$2","v":0},{"$f":"$D$6-J28","v":0},{"$f":"H28*$D$3/12","v":0},{"$f":"H28-I28","v":0},null,1,{"$f":"$E$2","v":0},{"$f":"$E$6-P28","v":0},{"$f":"N28*$E$3/12","v":0},{"$f":"N28-O28","v":0},{"$f":"P28*$E$19","v":0},{"$f":"P28-R28","v":0}]
[{"$f":"A28+1","v":2},{"$f":"E28","v":0},{"$f":"$C$6-D29","v":0},{"$f":"B29*$C$3/12","v":0},{"$f":"B29-C29","v":0},{"$f":"E29/$C$2","v":{"$error":"#DIV/0!"}},{"$f":"G28+1","v":2},{"$f":"K28","v":0},{"$f":"$D$6-J29","v":0},{"$f":"H29*$D$3/12","v":0},{"$f":"H29-I29","v":0},null,{"$f":"M28+1","v":2},{"$f":"Q28","v":0},0,0,0,0,0]
[3,{"$f":"E29","v":0},{"$f":"$C$6-D30","v":0},{"$f":"B30*$C$3/12","v":0},{"$f":"B30-C30","v":0},{"$error":"#DIV/0!"},3,{"$f":"K29","v":0},{"$f":"$D$6-J30","v":0},{"$f":"H30*$D$3/12","v":0},{"$f":"H30-I30","v":0},null,3,0,0,0,0,0,0]
[4,0,0,0,0,{"$error":"#DIV/0!"},4,0,0,0,0,null,4,0,0,0,0,0,0]
[5,0,0,0,0,{"$error":"#DIV/0!"},5,0,0,0,0,null,5,0,0,0,0,0,0]
[6,0,0,0,0,{"$error":"#DIV/0!"},6,0,0,0,0,null,6,0,0,0,0,0,0]
[7,0,0,0,0,{"$error":"#DIV/0!"},7,0,0,0,0,null,7,0,0,0,0,0,0]
[8,0,0,0,0,{"$error":"#DIV/0!"},8,0,0,0,0,null,8,0,0,0,0,0,0]
[9,0,0,0,0,{"$error":"#DIV/0!"},9,0,0,0,0,null,9,0,0,0,0,0,0]
[10,0,0,0,0,{"$error":"#DIV/0!"},10,0,0,0,0,null,10,0,0,0,0,0,0]
[11,0,0,0,0,{"$error":"#DIV/0!"},11,0,0,0,0,null,11,0,0,0,0,0,0]
[12,0,0,0,0,{"$error":"#DIV/0!"},12,0,0,0,0,null,12,0,0,0,0,0,0]
[13,0,0,0,0,{"$error":"#DIV/0!"},13,0,0,0,0,null,13,0,0,0,0,0,0]
[14,0,0,0,0,{"$error":"#DIV/0!"},14,0,0,0,0,null,14,0,0,0,0,0,0]
[15,0,0,0,0,{"$error":"#DIV/0!"},15,0,0,0,0,null,15,0,0,0,0,0,0]
[16,0,0,0,0,{"$error":"#DIV/0!"},16,0,0,0,0,null,16,0,0,0,0,0,0]
[17,0,0,0,0,{"$error":"#DIV/0!"},17,0,0,0,0,null,17,0,0,0,0,0,0]
[18,0,0,0,0,{"$error":"#DIV/0!"},18,0,0,0,0,null,18,0,0,0,0,0,0]
[19,0,0,0,0,{"$error":"#DIV/0!"},19,0,0,0,0,null,19,0,0,0,0,0,0]
[20,0,0,0,0,{"$error":"#DIV/0!"},20,0,0,0,0,null,20,0,0,0,0,0,0]
[21,0,0,0,0,{"$error":"#DIV/0!"},21,0,0,0,0,null,21,0,0,0,0,0,0]
[22,0,0,0,0,{"$error":"#DIV/0!"},22,0,0,0,0,null,22,0,0,0,0,0,0]
[23,0,0,0,0,{"$error":"#DIV/0!"},23,0,0,0,0,null,23,0,0,0,0,0,0]
[24,0,0,0,0,{"$error":"#DIV/0!"},24,0,0,0,0,null,24,0,0,0,0,0,0]
[25,0,0,0,0,{"$error":"#DIV/0!"},25,0,0,0,0,null,25,0,0,0,0,0,0]
[26,0,0,0,0,{"$error":"#DIV/0!"},26,0,0,0,0,null,26,0,0,0,0,0,0]
[27,0,0,0,0,{"$error":"#DIV/0!"},27,0,0,0,0,null,27,0,0,0,0,0,0]
[28,0,0,0,0,{"$error":"#DIV/0!"},28,0,0,0,0,null,28,0,0,0,0,0,0]
[29,0,0,0,0,{"$error":"#DIV/0!"},29,0,0,0,0,null,29,0,0,0,0,0,0]
[30,0,0,0,0,{"$error":"#DIV/0!"},30,0,0,0,0,null,30,0,0,0,0,0,0]
[31,0,0,0,0,{"$error":"#DIV/0!"},31,0,0,0,0,null,31,0,0,0,0,0,0]
[32,0,0,0,0,{"$error":"#DIV/0!"},32,0,0,0,0,null,32,0,0,0,0,0,0]
[33,0,0,0,0,{"$error":"#DIV/0!"},33,0,0,0,0,null,33,0,0,0,0,0,{"$f":"P60-R60","v":0}]
[34,0,0,0,0,{"$error":"#DIV/0!"},34,0,0,0,0,null,34,0,0,0,0,0,0]
[35,0,0,0,0,{"$error":"#DIV/0!"},35,0,0,0,0,null,35,0,0,0,0,0,0]
[36,0,0,0,0,{"$error":"#DIV/0!"},36,0,0,0,0,null,36,0,0,0,0,0,0]
[37,0,0,0,0,{"$error":"#DIV/0!"},37,0,0,0,0,null,37,0,0,0,0,0,0]
[38,0,0,0,0,{"$error":"#DIV/0!"},38,0,0,0,0,null,38,0,0,0,0,0,0]
[39,0,0,0,0,{"$error":"#DIV/0!"},39,0,0,0,0,null,39,0,0,0,0,0,0]
[40,0,0,0,0,{"$error":"#DIV/0!"},40,0,0,0,0,null,40,0,0,0,0,0,0]
[41,0,0,0,0,{"$error":"#DIV/0!"},41,0,0,0,0,null,41,0,0,0,0,0,0]
[42,0,0,0,0,{"$error":"#DIV/0!"},42,0,0,0,0,null,42,0,0,0,0,0,0]
[43,0,0,0,0,{"$error":"#DIV/0!"},43,0,0,0,0,null,43,0,0,0,0,0,0]
[44,0,0,0,0,{"$error":"#DIV/0!"},44,0,0,0,0,null,44,0,0,0,0,0,0]
[45,0,0,0,0,{"$error":"#DIV/0!"},45,0,0,0,0,null,45,0,0,0,0,0,0]
[46,0,0,0,0,{"$error":"#DIV/0!"},46,0,0,0,0,null,46,0,0,0,0,0,0]
[47,0,0,0,0,{"$error":"#DIV/0!"},47,0,0,0,0,null,47,0,0,0,0,0,0]
[48,0,0,0,0,{"$error":"#DIV/0!"},48,0,0,0,0,null,48,0,0,0,0,0,0]
[49,0,0,0,0,{"$error":"#DIV/0!"},49,0,0,0,0,null,49,0,0,0,0,0,0]
[50,0,0,0,0,{"$error":"#DIV/0!"},50,0,0,0,0,null,50,0,0,0,0,0,0]
[51,0,0,0,0,{"$error":"#DIV/0!"},51,0,0,0,0,null,51,0,0,0,0,0,0]
[52,0,0,0,0,{"$error":"#DIV/0!"},52,0,0,0,0,null,52,0,0,0,0,0,0]
[53,0,0,0,0,{"$error":"#DIV/0!"},53,0,0,0,0,null,53,0,0,0,0,0,0]
[54,0,0,0,0,{"$error":"#DIV/0!"},54,0,0,0,0,null,54,0,0,0,0,0,0]
[55,0,0,0,0,{"$error":"#DIV/0!"},55,0,0,0,0,null,55,0,0,0,0,0,0]
[56,0,0,0,0,{"$error":"#DIV/0!"},56,0,0,0,0,null,56,0,0,0,0,0,0]
[57,0,0,0,0,{"$error":"#DIV/0!"},57,0,0,0,0,null,57,0,0,0,0,0,0]
[58,0,0,0,0,{"$error":"#DIV/0!"},58,0,0,0,0,null,58,0,0,0,0,0,0]
[59,0,0,0,0,{"$error":"#DIV/0!"},59,0,0,0,0,null,59,0,0,0,0,0,0]
[60,0,0,0,0,{"$error":"#DIV/0!"},60,0,0,0,0,null,60,0,0,0,0,0,0]
[61,0,0,0,0,{"$error":"#DIV/0!"},61,0,0,0,0,null,61,0,0,0,0,0,0]
[62,0,0,0,0,{"$error":"#DIV/0!"},62,0,0,0,0,null,62,0,0,0,0,0,0]
[63,0,0,0,0,{"$error":"#DIV/0!"},63,0,0,0,0,null,63,0,0,0,0,0,0]
[64,0,0,0,0,{"$error":"#DIV/0!"},64,0,0,0,0,null,64,0,0,0,0,0,0]
[65,0,0,0,0,{"$error":"#DIV/0!"},65,0,0,0,0,null,65,0,{"$f":"$E$6-P92","v":0},{"$f":"N92*$E$3/12","v":0},{"$f":"N92-O92","v":0},{"$f":"P92*$E$19","v":0},{"$f":"P92-R92","v":0}]
[{"$f":"A92+1","v":66},0,0,0,0,{"$f":"E93/$C$2","v":{"$error":"#DIV/0!"}},{"$f":"G92+1","v":66},0,0,0,0,null,{"$f":"M92+1","v":66},{"$f":"Q92","v":0},0,0,0,0,0]
[67,{"$f":"E93","v":0},{"$f":"$C$6-D94","v":0},{"$f":"B94*$C$3/12","v":0},{"$f":"B94-C94","v":0},{"$error":"#DIV/0!"},67,{"$f":"K93","v":0},{"$f":"$D$6-J94","v":0},{"$f":"H94*$D$3/12","v":0},{"$f":"H94-I94","v":0},null,67,0,0,0,0,0,0]
[68,0,0,0,0,{"$error":"#DIV/0!"},68,0,0,0,0,null,68,0,0,0,0,0,0]
[69,0,0,0,0,{"$error":"#DIV/0!"},69,0,0,0,0,null,69,0,0,0,0,0,0]
[70,0,0,0,0,{"$error":"#DIV/0!"},70,0,0,0,0,null,70,0,0,0,0,0,0]
[71,0,0,0,0,{"$error":"#DIV/0!"},71,0,0,0,0,null,71,0,0,0,0,0,0]
[72,0,0,0,0,{"$error":"#DIV/0!"},72,0,0,0,0,null,72,0,0,0,0,0,0]
[73,0,0,0,0,{"$error":"#DIV/0!"},73,0,0,0,0,null,73,0,0,0,0,0,0]
[74,0,0,0,0,{"$error":"#DIV/0!"},74,0,0,0,0,null,74,0,0,0,0,0,0]
[75,0,0,0,0,{"$error":"#DIV/0!"},75,0,0,0,0,null,75,0,0,0,0,0,0]
[76,0,0,0,0,{"$error":"#DIV/0!"},76,0,0,0,0,null,76,0,0,0,0,0,0]
[77,0,0,0,0,{"$error":"#DIV/0!"},77,0,0,0,0,null,77,0,0,0,0,0,0]
[78,0,0,0,0,{"$error":"#DIV/0!"},78,0,0,0,0,null,78,0,0,0,0,0,0]
[79,0,0,0,0,{"$error":"#DIV/0!"},79,0,0,0,0,null,79,0,0,0,0,0,0]
[80,0,0,0,0,{"$error":"#DIV/0!"},80,0,0,0,0,null,80,0,0,0,0,0,0]
[81,0,0,0,0,{"$error":"#DIV/0!"},81,0,0,0,0,null,81,0,0,0,0,0,0]
[82,0,0,0,0,{"$error":"#DIV/0!"},82,0,0,0,0,null,82,0,0,0,0,0,0]
[83,0,0,0,0,{"$error":"#DIV/0!"},83,0,0,0,0,null,83,0,0,0,0,0,0]
[84,0,0,0,0,{"$error":"#DIV/0!"},84,0,0,0,0,null,84,0,0,0,0,0,0]
[85,0,0,0,0,{"$error":"#DIV/0!"},85,0,0,0,0,null,85,0,0,0,0,0,0]
[86,0,0,0,0,{"$error":"#DIV/0!"},86,0,0,0,0,null,86,0,0,0,0,0,0]
[87,0,0,0,0,{"$error":"#DIV/0!"},87,0,0,0,0,null,87,0,0,0,0,0,0]
[88,0,0,0,0,{"$error":"#DIV/0!"},88,0,0,0,0,null,88,0,0,0,0,0,0]
[89,0,0,0,0,{"$error":"#DIV/0!"},89,0,0,0,0,null,89,0,0,0,0,0,0]
[90,0,0,0,0,{"$error":"#DIV/0!"},90,0,0,0,0,null,90,0,0,0,0,0,0]
[91,0,0,0,0,{"$error":"#DIV/0!"},91,0,0,0,0,null,91,0,0,0,0,0,0]
[92,0,0,0,0,{"$error":"#DIV/0!"},92,0,0,0,0,null,92,0,0,0,0,0,0]
[93,0,0,0,0,{"$error":"#DIV/0!"},93,0,0,0,0,null,93,0,0,0,0,0,0]
[94,0,0,0,0,{"$error":"#DIV/0!"},94,0,0,0,0,null,94,0,0,0,0,0,0]
[95,0,0,0,0,{"$error":"#DIV/0!"},95,0,0,0,0,null,95,0,0,0,0,0,0]
[96,0,0,0,0,{"$error":"#DIV/0!"},96,0,0,0,0,null,96,0,0,0,0,0,0]
[97,0,0,0,0,{"$error":"#DIV/0!"},97,0,0,0,0,null,97,0,0,0,0,0,{"$f":"P124-R124","v":0}]
[98,0,0,0,0,{"$error":"#DIV/0!"},98,0,0,0,0,null,98,0,0,0,0,0,0]
[99,0,0,0,0,{"$error":"#DIV/0!"},99,0,0,0,0,null,99,0,0,0,0,0,0]
[100,0,0,0,0,{"$error":"#DIV/0!"},100,0,0,0,0,null,100,0,0,0,0,0,0]
[101,0,0,0,0,{"$error":"#DIV/0!"},101,0,0,0,0,null,101,0,0,0,0,0,0]
[102,0,0,0,0,{"$error":"#DIV/0!"},102,0,0,0,0,null,102,0,0,0,0,0,0]
[103,0,0,0,0,{"$error":"#DIV/0!"},103,0,0,0,0,null,103,0,0,0,0,0,0]
[104,0,0,0,0,{"$error":"#DIV/0!"},104,0,0,0,0,null,104,0,0,0,0,0,0]
[105,0,0,0,0,{"$error":"#DIV/0!"},105,0,0,0,0,null,105,0,0,0,0,0,0]
[106,0,0,0,0,{"$error":"#DIV/0!"},106,0,0,0,0,null,106,0,0,0,0,0,0]
[107,0,0,0,0,{"$error":"#DIV/0!"},107,0,0,0,0,null,107,0,0,0,0,0,0]
[108,0,0,0,0,{"$error":"#DIV/0!"},108,0,0,0,0,null,108,0,0,0,0,0,0]
[109,0,0,0,0,{"$error":"#DIV/0!"},109,0,0,0,0,null,109,0,0,0,0,0,{"$f":"P136-R136","v":0}]
[110,0,0,0,0,{"$error":"#DIV/0!"},110,0,0,0,0,null,110,0,0,0,0,0,0]
[111,0,0,0,0,{"$error":"#DIV/0!"},111,0,0,0,0,null,111,0,0,0,0,0,0]
[112,0,0,0,0,{"$error":"#DIV/0!"},112,0,0,0,0,null,112,0,0,0,0,0,0]
[113,0,0,0,0,{"$error":"#DIV/0!"},113,0,0,0,0,null,113,0,0,0,0,0,0]
[114,0,0,0,0,{"$error":"#DIV/0!"},114,0,0,0,0,null,114,0,0,0,0,0,0]
[115,0,0,0,0,{"$error":"#DIV/0!"},115,0,0,0,0,null,115,0,0,0,0,0,0]
[116,0,0,0,0,{"$error":"#DIV/0!"},116,0,0,0,0,null,116,0,0,0,0,0,0]
[117,0,0,0,0,{"$error":"#DIV/0!"},117,0,0,0,0,null,117,0,0,0,0,0,0]
[118,0,0,0,0,{"$error":"#DIV/0!"},118,0,0,0,0,null,118,0,0,0,0,0,0]
[119,0,0,0,0,{"$error":"#DIV/0!"},119,0,0,0,0,null,119,0,0,0,0,0,0]
[120,0,0,0,0,{"$error":"#DIV/0!"},120,0,0,0,0,null,120,0,0,0,0,0,0]
[121,0,0,0,0,{"$error":"#DIV/0!"},121,0,0,0,0,null,121,0,0,0,0,0,0]
[122,0,0,0,0,{"$error":"#DIV/0!"},122,0,0,0,0,null,122,0,0,0,0,0,0]
[123,0,0,0,0,{"$error":"#DIV/0!"},123,0,0,0,0,null,123,0,0,0,0,0,0]
[124,0,0,0,0,{"$error":"#DIV/0!"},124,0,0,0,0,null,124,0,0,0,0,0,0]
[125,0,0,0,0,{"$error":"#DIV/0!"},125,0,0,0,0,null,125,0,0,0,0,0,0]
[126,0,0,0,0,{"$error":"#DIV/0!"},126,0,0,0,0,null,126,0,0,0,0,0,0]
[127,0,0,0,0,{"$error":"#DIV/0!"},127,0,0,0,0,null,127,0,0,0,0,0,0]
[128,0,0,0,0,{"$error":"#DIV/0!"},128,0,0,0,0,null,128,0,0,0,0,0,0]
[129,0,0,0,0,{"$error":"#DIV/0!"},129,0,0,0,0,null,129,0,{"$f":"$E$6-P156","v":0},{"$f":"N156*$E$3/12","v":0},{"$f":"N156-O156","v":0},{"$f":"P156*$E$19","v":0},0]
[{"$f":"A156+1","v":130},0,0,0,0,{"$f":"E157/$C$2","v":{"$error":"#DIV/0!"}},{"$f":"G156+1","v":130},0,0,0,0,null,{"$f":"M156+1","v":130},{"$f":"Q156","v":0},0,0,0,0,0]
[131,{"$f":"E157","v":0},{"$f":"$C$6-D158","v":0},{"$f":"B158*$C$3/12","v":0},{"$f":"B158-C158","v":0},{"$error":"#DIV/0!"},131,{"$f":"K157","v":0},{"$f":"$D$6-J158","v":0},{"$f":"H158*$D$3/12","v":0},{"$f":"H158-I158","v":0},null,131,0,0,0,0,0,0]
[132,0,0,0,0,{"$error":"#DIV/0!"},132,0,0,0,0,null,132,0,0,0,0,0,0]
[133,0,0,0,0,{"$error":"#DIV/0!"},133,0,0,0,0,null,133,0,0,0,0,0,0]
[134,0,0,0,0,{"$error":"#DIV/0!"},134,0,0,0,0,null,134,0,0,0,0,0,0]
[135,0,0,0,0,{"$error":"#DIV/0!"},135,0,0,0,0,null,135,0,0,0,0,0,0]
[136,0,0,0,0,{"$error":"#DIV/0!"},136,0,0,0,0,null,136,0,0,0,0,0,0]
[137,0,0,0,0,{"$error":"#DIV/0!"},137,0,0,0,0,null,137,0,0,0,0,0,0]
[138,0,0,0,0,{"$error":"#DIV/0!"},138,0,0,0,0,null,138,0,0,0,0,0,0]
[139,0,0,0,0,{"$error":"#DIV/0!"},139,0,0,0,0,null,139,0,0,0,0,0,0]
[140,0,0,0,0,{"$error":"#DIV/0!"},140,0,0,0,0,null,140,0,0,0,0,0,0]
[141,0,0,0,0,{"$error":"#DIV/0!"},141,0,0,0,0,null,141,0,0,0,0,0,0]
[142,0,0,0,0,{"$error":"#DIV/0!"},142,0,0,0,0,null,142,0,0,0,0,0,0]
[143,0,0,0,0,{"$error":"#DIV/0!"},143,0,0,0,0,null,143,0,0,0,0,0,0]
[144,0,0,0,0,{"$error":"#DIV/0!"},144,0,0,0,0,null,144,0,0,0,0,0,0]
[145,0,0,0,0,{"$error":"#DIV/0!"},145,0,0,0,0,null,145,0,0,0,0,0,0]
[146,0,0,0,0,{"$error":"#DIV/0!"},146,0,0,0,0,null,146,0,0,0,0,0,0]
[147,0,0,0,0,{"$error":"#DIV/0!"},147,0,0,0,0,null,147,0,0,0,0,0,0]
[148,0,0,0,0,{"$error":"#DIV/0!"},148,0,0,0,0,null,148,0,0,0,0,0,0]
[149,0,0,0,0,{"$error":"#DIV/0!"},149,0,0,0,0,null,149,0,0,0,0,0,0]
[150,0,0,0,0,{"$error":"#DIV/0!"},150,0,0,0,0,null,150,0,0,0,0,0,0]
[151,0,0,0,0,{"$error":"#DIV/0!"},151,0,0,0,0,null,151,0,0,0,0,0,0]
[152,0,0,0,0,{"$error":"#DIV/0!"},152,0,0,0,0,null,152,0,0,0,0,0,0]
[153,0,0,0,0,{"$error":"#DIV/0!"},153,0,0,0,0,null,153,0,0,0,0,0,0]
[154,0,0,0,0,{"$error":"#DIV/0!"},154,0,0,0,0,null,154,0,0,0,0,0,0]
[155,0,0,0,0,{"$error":"#DIV/0!"},155,0,0,0,0,null,155,0,0,0,0,0,0]
[156,0,0,0,0,{"$error":"#DIV/0!"},156,0,0,0,0,null,156,0,0,0,0,0,0]
[157,0,0,0,0,{"$error":"#DIV/0!"},157,0,0,0,0,null,157,0,0,0,0,0,0]
[158,0,0,0,0,{"$error":"#DIV/0!"},158,0,0,0,0,null,158,0,0,0,0,0,0]
[159,0,0,0,0,{"$error":"#DIV/0!"},159,0,0,0,0,null,159,0,0,0,0,0,0]
[160,0,0,0,0,{"$error":"#DIV/0!"},160,0,0,0,0,null,160,0,0,0,0,0,0]
[161,0,0,0,0,{"$error":"#DIV/0!"},161,0,0,0,0,null,161,0,0,0,0,0,0]
[162,0,0,0,0,{"$error":"#DIV/0!"},162,0,0,0,0,null,162,0,0,0,0,0,0]
[163,0,0,0,0,{"$error":"#DIV/0!"},163,0,0,0,0,null,163,0,0,0,0,0,0]
[164,0,0,0,0,{"$error":"#DIV/0!"},164,0,0,0,0,null,164,0,0,0,0,0,0]
[165,0,0,0,0,{"$error":"#DIV/0!"},165,0,0,0,0,null,165,0,0,0,0,0,0]
[166,0,0,0,0,{"$error":"#DIV/0!"},166,0,0,0,0,null,166,0,0,0,0,0,0]
[167,0,0,0,0,{"$error":"#DIV/0!"},167,0,0,0,0,null,167,0,0,0,0,0,0]
[168,0,0,0,0,{"$error":"#DIV/0!"},168,0,0,0,0,null,168,0,0,0,0,0,0]
[169,0,0,0,0,{"$error":"#DIV/0!"},169,0,0,0,0,null,169,0,0,0,0,0,0]
[170,0,0,0,0,{"$error":"#DIV/0!"},170,0,0,0,0,null,170,0,0,0,0,0,0]
[171,0,0,0,0,{"$error":"#DIV/0!"},171,0,0,0,0,null,171,0,0,0,0,0,0]
[172,0,0,0,0,{"$error":"#DIV/0!"},172,0,0,0,0,null,172,0,0,0,0,0,0]
[173,0,0,0,0,{"$error":"#DIV/0!"},173,0,0,0,0,null,173,0,0,0,0,0,{"$f":"P200-R200","v":0}]
[174,0,0,0,0,{"$error":"#DIV/0!"},174,0,0,0,0,null,174,0,0,0,0,0,0]
[175,0,0,0,0,{"$error":"#DIV/0!"},175,0,0,0,0,null,175,0,0,0,0,0,0]
[176,0,0,0,0,{"$error":"#DIV/0!"},176,0,0,0,0,null,176,0,0,0,0,0,0]
[177,0,0,0,0,{"$error":"#DIV/0!"},177,0,0,0,0,null,177,0,0,0,0,0,0]
[178,0,0,0,0,{"$error":"#DIV/0!"},178,0,0,0,0,null,178,0,0,0,0,0,0]
[179,0,0,0,0,{"$error":"#DIV/0!"},179,0,0,0,0,null,179,0,0,0,0,0,0]
[180,0,0,0,0,{"$error":"#DIV/0!"},180,0,0,0,0,null,180,0,0,0,0,0,0]
[181,0,0,0,0,{"$error":"#DIV/0!"},181,0,0,0,0,null,181,0,0,0,0,0,0]
[182,0,0,0,0,{"$error":"#DIV/0!"},182,0,0,0,0,null,182,0,0,0,0,0,0]
[183,0,0,0,0,{"$error":"#DIV/0!"},183,0,0,0,0,null,183,0,0,0,0,0,0]
[184,0,0,0,0,{"$error":"#DIV/0!"},184,0,0,0,0,null,184,0,0,0,0,0,0]
[185,0,0,0,0,{"$error":"#DIV/0!"},185,0,0,0,0,null,185,0,0,0,0,0,0]
[186,0,0,0,0,{"$error":"#DIV/0!"},186,0,0,0,0,null,186,0,0,0,0,0,0]
[187,0,0,0,0,{"$error":"#DIV/0!"},187,0,0,0,0,null,187,0,0,0,0,0,0]
[188,0,0,0,0,{"$error":"#DIV/0!"},188,0,0,0,0,null,188,0,0,0,0,0,0]
[189,0,0,0,0,{"$error":"#DIV/0!"},189,0,0,0,0,null,189,0,0,0,0,0,0]
[190,0,0,0,0,{"$error":"#DIV/0!"},190,0,0,0,0,null,190,0,0,0,0,0,0]
[191,0,0,0,0,{"$error":"#DIV/0!"},191,0,0,0,0,null,191,0,0,0,0,0,0]
[192,0,0,0,0,{"$error":"#DIV/0!"},192,0,0,0,0,null,192,0,0,0,0,0,0]
[193,0,0,0,0,{"$error":"#DIV/0!"},193,0,0,0,0,null,193,0,{"$f":"$E$6-P220","v":0},{"$f":"N220*$E$3/12","v":0},{"$f":"N220-O220","v":0},{"$f":"P220*$E$19","v":0},0]
[{"$f":"A220+1","v":194},0,0,0,0,{"$f":"E221/$C$2","v":{"$error":"#DIV/0!"}},{"$f":"G220+1","v":194},0,0,0,0,null,{"$f":"M220+1","v":194},{"$f":"Q220","v":0},0,0,0,0,0]
[195,{"$f":"E221","v":0},{"$f":"$C$6-D222","v":0},{"$f":"B222*$C$3/12","v":0},{"$f":"B222-C222","v":0},{"$error":"#DIV/0!"},195,{"$f":"K221","v":0},{"$f":"$D$6-J222","v":0},{"$f":"H222*$D$3/12","v":0},{"$f":"H222-I222","v":0},null,195,0,0,0,0,0,0]
[196,0,0,0,0,{"$error":"#DIV/0!"},196,0,0,0,0,null,196,0,0,0,0,0,0]
[197,0,0,0,0,{"$error":"#DIV/0!"},197,0,0,0,0,null,197,0,0,0,0,0,0]
[198,0,0,0,0,{"$error":"#DIV/0!"},198,0,0,0,0,null,198,0,0,0,0,0,0]
[199,0,0,0,0,{"$error":"#DIV/0!"},199,0,0,0,0,null,199,0,0,0,0,0,0]
[200,0,0,0,0,{"$error":"#DIV/0!"},200,0,0,0,0,null,200,0,0,0,0,0,0]
[201,0,0,0,0,{"$error":"#DIV/0!"},201,0,0,0,0,null,201,0,0,0,0,0,0]
[202,0,0,0,0,{"$error":"#DIV/0!"},202,0,0,0,0,null,202,0,0,0,0,0,0]
[203,0,0,0,0,{"$error":"#DIV/0!"},203,0,0,0,0,null,203,0,0,0,0,0,0]
[204,0,0,0,0,{"$error":"#DIV/0!"},204,0,0,0,0,null,204,0,0,0,0,0,0]
[205,0,0,0,0,{"$error":"#DIV/0!"},205,0,0,0,0,null,205,0,0,0,0,0,0]
[206,0,0,0,0,{"$error":"#DIV/0!"},206,0,0,0,0,null,206,0,0,0,0,0,0]
[207,0,0,0,0,{"$error":"#DIV/0!"},207,0,0,0,0,null,207,0,0,0,0,0,0]
[208,0,0,0,0,{"$error":"#DIV/0!"},208,0,0,0,0,null,208,0,0,0,0,0,0]
[209,0,0,0,0,{"$error":"#DIV/0!"},209,0,0,0,0,null,209,0,0,0,0,0,0]
[210,0,0,0,0,{"$error":"#DIV/0!"},210,0,0,0,0,null,210,0,0,0,0,0,0]
[211,0,0,0,0,{"$error":"#DIV/0!"},211,0,0,0,0,null,211,0,0,0,0,0,0]
[212,0,0,0,0,{"$error":"#DIV/0!"},212,0,0,0,0,null,212,0,0,0,0,0,0]
[213,0,0,0,0,{"$error":"#DIV/0!"},213,0,0,0,0,null,213,0,0,0,0,0,0]
[214,0,0,0,0,{"$error":"#DIV/0!"},214,0,0,0,0,null,214,0,0,0,0,0,0]
[215,0,0,0,0,{"$error":"#DIV/0!"},215,0,0,0,0,null,215,0,0,0,0,0,0]
[216,0,0,0,0,{"$error":"#DIV/0!"},216,0,0,0,0,null,216,0,0,0,0,0,0]
[217,0,0,0,0,{"$error":"#DIV/0!"},217,0,0,0,0,null,217,0,0,0,0,0,0]
[218,0,0,0,0,{"$error":"#DIV/0!"},218,0,0,0,0,null,218,0,0,0,0,0,0]
[219,0,0,0,0,{"$error":"#DIV/0!"},219,0,0,0,0,null,219,0,0,0,0,0,0]
[220,0,0,0,0,{"$error":"#DIV/0!"},220,0,0,0,0,null,220,0,0,0,0,0,0]
[221,0,0,0,0,{"$error":"#DIV/0!"},221,0,0,0,0,null,221,0,0,0,0,0,0]
[222,0,0,0,0,{"$error":"#DIV/0!"},222,0,0,0,0,null,222,0,0,0,0,0,0]
[223,0,0,0,0,{"$error":"#DIV/0!"},223,0,0,0,0,null,223,0,0,0,0,0,0]
[224,0,0,0,0,{"$error":"#DIV/0!"},224,0,0,0,0,null,224,0,0,0,0,0,0]
[225,0,0,0,0,{"$error":"#DIV/0!"},225,0,0,0,0,null,225,0,0,0,0,0,0]
[226,0,0,0,0,{"$error":"#DIV/0!"},226,0,0,0,0,null,226,0,0,0,0,0,0]
[227,0,0,0,0,{"$error":"#DIV/0!"},227,0,0,0,0,null,227,0,0,0,0,0,0]
[228,0,0,0,0,{"$error":"#DIV/0!"},228,0,0,0,0,null,228,0,0,0,0,0,0]
[229,0,0,0,0,{"$error":"#DIV/0!"},229,0,0,0,0,null,229,0,0,0,0,0,0]
[230,0,0,0,0,{"$error":"#DIV/0!"},230,0,0,0,0,null,230,0,0,0,0,0,0]
[231,0,0,0,0,{"$error":"#DIV/0!"},231,0,0,0,0,null,231,0,0,0,0,0,0]
[232,0,0,0,0,{"$error":"#DIV/0!"},232,0,0,0,0,null,232,0,0,0,0,0,0]
[233,0,0,0,0,{"$error":"#DIV/0!"},233,0,0,0,0,null,233,0,0,0,0,0,0]
[234,0,0,0,0,{"$error":"#DIV/0!"},234,0,0,0,0,null,234,0,0,0,0,0,0]
[235,0,0,0,0,{"$error":"#DIV/0!"},235,0,0,0,0,null,235,0,0,0,0,0,0]
[236,0,0,0,0,{"$error":"#DIV/0!"},236,0,0,0,0,null,236,0,0,0,0,0,0]
[237,0,0,0,0,{"$error":"#DIV/0!"},237,0,0,0,0,null,237,0,0,0,0,0,{"$f":"P264-R264","v":0}]
[238,0,0,0,0,{"$error":"#DIV/0!"},238,0,0,0,0,null,238,0,0,0,0,0,0]
[239,0,0,0,0,{"$error":"#DIV/0!"},239,0,0,0,0,null,239,0,0,0,0,0,0]
[240,0,0,0,0,{"$error":"#DIV/0!"},240,0,0,0,0,null,240,0,0,0,0,0,0]
[241,0,0,0,0,{"$error":"#DIV/0!"},241,0,0,0,0,null,241,0,0,0,0,0,0]
[242,0,0,0,0,{"$error":"#DIV/0!"},242,0,0,0,0,null,242,0,0,0,0,0,0]
[243,0,0,0,0,{"$error":"#DIV/0!"},243,0,0,0,0,null,243,0,0,0,0,0,0]
[244,0,0,0,0,{"$error":"#DIV/0!"},244,0,0,0,0,null,244,0,0,0,0,0,0]
[245,0,0,0,0,{"$error":"#DIV/0!"},245,0,0,0,0,null,245,0,0,0,0,0,0]
[246,0,0,0,0,{"$error":"#DIV/0!"},246,0,0,0,0,null,246,0,0,0,0,0,0]
[247,0,0,0,0,{"$error":"#DIV/0!"},247,0,0,0,0,null,247,0,0,0,0,0,0]
[248,0,0,0,0,{"$error":"#DIV/0!"},248,0,0,0,0,null,248,0,0,0,0,0,0]
[249,0,0,0,0,{"$error":"#DIV/0!"},249,0,0,0,0,null,249,0,0,0,0,0,0]
[250,0,0,0,0,{"$error":"#DIV/0!"},250,0,0,0,0,null,250,0,0,0,0,0,0]
[251,0,0,0,0,{"$error":"#DIV/0!"},251,0,0,0,0,null,251,0,0,0,0,0,0]
[252,0,0,0,0,{"$error":"#DIV/0!"},252,0,0,0,0,null,252,0,0,0,0,0,0]
[253,0,0,0,0,{"$error":"#DIV/0!"},253,0,0,0,0,null,253,0,0,0,0,0,0]
[254,0,0,0,0,{"$error":"#DIV/0!"},254,0,0,0,0,null,254,0,0,0,0,0,0]
[255,0,0,0,0,{"$error":"#DIV/0!"},255,0,0,0,0,null,255,0,0,0,0,0,0]
[256,0,0,0,0,{"$error":"#DIV/0!"},256,0,0,0,0,null,256,0,0,0,0,0,0]
[257,0,0,0,0,{"$error":"#DIV/0!"},257,0,0,0,0,null,257,0,{"$f":"$E$6-P284","v":0},{"$f":"N284*$E$3/12","v":0},{"$f":"N284-O284","v":0},{"$f":"P284*$E$19","v":0},0]
[{"$f":"A284+1","v":258},0,0,0,0,{"$f":"E285/$C$2","v":{"$error":"#DIV/0!"}},{"$f":"G284+1","v":258},0,0,0,0,null,{"$f":"M284+1","v":258},{"$f":"Q284","v":0},0,0,0,0,0]
[259,{"$f":"E285","v":0},{"$f":"$C$6-D286","v":0},{"$f":"B286*$C$3/12","v":0},{"$f":"B286-C286","v":0},{"$error":"#DIV/0!"},259,{"$f":"K285","v":0},{"$f":"$D$6-J286","v":0},{"$f":"H286*$D$3/12","v":0},{"$f":"H286-I286","v":0},null,259,0,0,0,0,0,0]
[260,0,0,0,0,{"$error":"#DIV/0!"},260,0,0,0,0,null,260,0,0,0,0,0,0]
[261,0,0,0,0,{"$error":"#DIV/0!"},261,0,0,0,0,null,261,0,0,0,0,0,0]
[262,0,0,0,0,{"$error":"#DIV/0!"},262,0,0,0,0,null,262,0,0,0,0,0,0]
[263,0,0,0,0,{"$error":"#DIV/0!"},263,0,0,0,0,null,263,0,0,0,0,0,0]
[264,0,0,0,0,{"$error":"#DIV/0!"},264,0,0,0,0,null,264,0,0,0,0,0,0]
[265,0,0,0,0,{"$error":"#DIV/0!"},265,0,0,0,0,null,265,0,0,0,0,0,0]
[266,0,0,0,0,{"$error":"#DIV/0!"},266,0,0,0,0,null,266,0,0,0,0,0,0]
[267,0,0,0,0,{"$error":"#DIV/0!"},267,0,0,0,0,null,267,0,0,0,0,0,0]
[268,0,0,0,0,{"$error":"#DIV/0!"},268,0,0,0,0,null,268,0,0,0,0,0,0]
[269,0,0,0,0,{"$error":"#DIV/0!"},269,0,0,0,0,null,269,0,0,0,0,0,0]
[270,0,0,0,0,{"$error":"#DIV/0!"},270,0,0,0,0,null,270,0,0,0,0,0,0]
[271,0,0,0,0,{"$error":"#DIV/0!"},271,0,0,0,0,null,271,0,0,0,0,0,0]
[272,0,0,0,0,{"$error":"#DIV/0!"},272,0,0,0,0,null,272,0,0,0,0,0,0]
[273,0,0,0,0,{"$error":"#DIV/0!"},273,0,0,0,0,null,273,0,0,0,0,0,0]
[274,0,0,0,0,{"$error":"#DIV/0!"},274,0,0,0,0,null,274,0,0,0,0,0,0]
[275,0,0,0,0,{"$error":"#DIV/0!"},275,0,0,0,0,null,275,0,0,0,0,0,0]
[276,0,0,0,0,{"$error":"#DIV/0!"},276,0,0,0,0,null,276,0,0,0,0,0,0]
[277,0,0,0,0,{"$error":"#DIV/0!"},277,0,0,0,0,null,277,0,0,0,0,0,0]
[278,0,0,0,0,{"$error":"#DIV/0!"},278,0,0,0,0,null,278,0,0,0,0,0,0]
[279,0,0,0,0,{"$error":"#DIV/0!"},279,0,0,0,0,null,279,0,0,0,0,0,0]
[280,0,0,0,0,{"$error":"#DIV/0!"},280,0,0,0,0,null,280,0,0,0,0,0,0]
[281,0,0,0,0,{"$error":"#DIV/0!"},281,0,0,0,0,null,281,0,0,0,0,0,0]
[282,0,0,0,0,{"$error":"#DIV/0!"},282,0,0,0,0,null,282,0,0,0,0,0,0]
[283,0,0,0,0,{"$error":"#DIV/0!"},283,0,0,0,0,null,283,0,0,0,0,0,0]
[284,0,0,0,0,{"$error":"#DIV/0!"},284,0,0,0,0,null,284,0,0,0,0,0,0]
[285,0,0,0,0,{"$error":"#DIV/0!"},285,0,0,0,0,null,285,0,0,0,0,0,0]
[286,0,0,0,0,{"$error":"#DIV/0!"},286,0,0,0,0,null,286,0,0,0,0,0,0]
[287,0,0,0,0,{"$error":"#DIV/0!"},287,0,0,0,0,null,287,0,0,0,0,0,0]
[288,0,0,0,0,{"$error":"#DIV/0!"},288,0,0,0,0,null,288,0,0,0,0,0,0]
[289,0,0,0,0,{"$error":"#DIV/0!"},289,0,0,0,0,null,289,0,0,0,0,0,0]
[290,0,0,0,0,{"$error":"#DIV/0!"},290,0,0,0,0,null,290,0,0,0,0,0,0]
[291,0,0,0,0,{"$error":"#DIV/0!"},291,0,0,0,0,null,291,0,0,0,0,0,0]
[292,0,0,0,0,{"$error":"#DIV/0!"},292,0,0,0,0,null,292,0,0,0,0,0,0]
[293,0,0,0,0,{"$error":"#DIV/0!"},293,0,0,0,0,null,293,0,0,0,0,0,0]
[294,0,0,0,0,{"$error":"#DIV/0!"},294,0,0,0,0,null,294,0,0,0,0,0,0]
[295,0,0,0,0,{"$error":"#DIV/0!"},295,0,0,0,0,null,295,0,0,0,0,0,0]
[296,0,0,0,0,{"$error":"#DIV/0!"},296,0,0,0,0,null,296,0,0,0,0,0,0]
[297,0,0,0,0,{"$error":"#DIV/0!"},297,0,0,0,0,null,297,0,0,0,0,0,0]
[298,0,0,0,0,{"$error":"#DIV/0!"},298,0,0,0,0,null,298,0,0,0,0,0,0]
[299,0,0,0,0,{"$error":"#DIV/0!"},299,0,0,0,0,null,299,0,0,0,0,0,0]
[300,0,0,0,0,{"$error":"#DIV/0!"},300,0,0,0,0,null,300,0,0,0,0,0,0]
[301,0,0,0,0,{"$error":"#DIV/0!"},301,0,0,0,0,null,301,0,0,0,0,0,{"$f":"P328-R328","v":0}]
[302,0,0,0,0,{"$error":"#DIV/0!"},302,0,0,0,0,null,302,0,0,0,0,0,0]
[303,0,0,0,0,{"$error":"#DIV/0!"},303,0,0,0,0,null,303,0,0,0,0,0,0]
[304,0,0,0,0,{"$error":"#DIV/0!"},304,0,0,0,0,null,304,0,0,0,0,0,0]
[305,0,0,0,0,{"$error":"#DIV/0!"},305,0,0,0,0,null,305,0,0,0,0,0,0]
[306,0,0,0,0,{"$error":"#DIV/0!"},306,0,0,0,0,null,306,0,0,0,0,0,0]
[307,0,0,0,0,{"$error":"#DIV/0!"},307,0,0,0,0,null,307,0,0,0,0,0,0]
[308,0,0,0,0,{"$error":"#DIV/0!"},308,0,0,0,0,null,308,0,0,0,0,0,0]
[309,0,0,0,0,{"$error":"#DIV/0!"},309,0,0,0,0,null,309,0,0,0,0,0,0]
[310,0,0,0,0,{"$error":"#DIV/0!"},310,0,0,0,0,null,310,0,0,0,0,0,0]
[311,0,0,0,0,{"$error":"#DIV/0!"},311,0,0,0,0,null,311,0,0,0,0,0,0]
[312,0,0,0,0,{"$error":"#DIV/0!"},312,0,0,0,0,null,312,0,0,0,0,0,0]
[313,0,0,0,0,{"$error":"#DIV/0!"},313,0,0,0,0,null,313,0,0,0,0,0,0]
[314,0,0,0,0,{"$error":"#DIV/0!"},314,0,0,0,0,null,314,0,0,0,0,0,0]
[315,0,0,0,0,{"$error":"#DIV/0!"},315,0,0,0,0,null,315,0,0,0,0,0,0]
[316,0,0,0,0,{"$error":"#DIV/0!"},316,0,0,0,0,null,316,0,0,0,0,0,0]
[317,0,0,0,0,{"$error":"#DIV/0!"},317,0,0,0,0,null,317,0,0,0,0,0,0]
[318,0,0,0,0,{"$error":"#DIV/0!"},318,0,0,0,0,null,318,0,0,0,0,0,0]
[319,0,0,0,0,{"$error":"#DIV/0!"},319,0,0,0,0,null,319,0,0,0,0,0,0]
[320,0,0,0,0,{"$error":"#DIV/0!"},320,0,0,0,0,null,320,0,0,0,0,0,0]
[321,0,0,0,0,{"$error":"#DIV/0!"},321,0,0,0,0,null,321,0,{"$f":"$E$6-P348","v":0},{"$f":"N348*$E$3/12","v":0},{"$f":"N348-O348","v":0},{"$f":"P348*$E$19","v":0},0]
[{"$f":"A348+1","v":322},0,0,0,0,{"$f":"E349/$C$2","v":{"$error":"#DIV/0!"}},{"$f":"G348+1","v":322},0,0,0,0,null,{"$f":"M348+1","v":322},{"$f":"Q348","v":0},0,0,0,0,0]
[323,{"$f":"E349","v":0},{"$f":"$C$6-D350","v":0},{"$f":"B350*$C$3/12","v":0},{"$f":"B350-C350","v":0},{"$error":"#DIV/0!"},323,{"$f":"K349","v":0},{"$f":"$D$6-J350","v":0},{"$f":"H350*$D$3/12","v":0},{"$f":"H350-I350","v":0},null,323,0,0,0,0,0,0]
[324,0,0,0,0,{"$error":"#DIV/0!"},324,0,0,0,0,null,324,0,0,0,0,0,0]
[325,0,0,0,0,{"$error":"#DIV/0!"},325,0,0,0,0,null,325,0,0,0,0,0,0]
[326,0,0,0,0,{"$error":"#DIV/0!"},326,0,0,0,0,null,326,0,0,0,0,0,0]
[327,0,0,0,0,{"$error":"#DIV/0!"},327,0,0,0,0,null,327,0,0,0,0,0,0]
[328,0,0,0,0,{"$error":"#DIV/0!"},328,0,0,0,0,null,328,0,0,0,0,0,0]
[329,0,0,0,0,{"$error":"#DIV/0!"},329,0,0,0,0,null,329,0,0,0,0,0,0]
[330,0,0,0,0,{"$error":"#DIV/0!"},330,0,0,0,0,null,330,0,0,0,0,0,0]
[331,0,0,0,0,{"$error":"#DIV/0!"},331,0,0,0,0,null,331,0,0,0,0,0,0]
[332,0,0,0,0,{"$error":"#DIV/0!"},332,0,0,0,0,null,332,0,0,0,0,0,0]
[333,0,0,0,0,{"$error":"#DIV/0!"},333,0,0,0,0,null,333,0,0,0,0,0,0]
[334,0,0,0,0,{"$error":"#DIV/0!"},334,0,0,0,0,null,334,0,0,0,0,0,0]
[335,0,0,0,0,{"$error":"#DIV/0!"},335,0,0,0,0,null,335,0,0,0,0,0,0]
[336,0,0,0,0,{"$error":"#DIV/0!"},336,0,0,0,0,null,336,0,0,0,0,0,0]
[337,0,0,0,0,{"$error":"#DIV/0!"},337,0,0,0,0,null,337,0,0,0,0,0,0]
[338,0,0,0,0,{"$error":"#DIV/0!"},338,0,0,0,0,null,338,0,0,0,0,0,0]
[339,0,0,0,0,{"$error":"#DIV/0!"},339,0,0,0,0,null,339,0,0,0,0,0,0]
[340,0,0,0,0,{"$error":"#DIV/0!"},340,0,0,0,0,null,340,0,0,0,0,0,0]
[341,0,0,0,0,{"$error":"#DIV/0!"},341,0,0,0,0,null,341,0,0,0,0,0,0]
[342,0,0,0,0,{"$error":"#DIV/0!"},342,0,0,0,0,null,342,0,0,0,0,0,0]
[343,0,0,0,0,{"$error":"#DIV/0!"},343,0,0,0,0,null,343,0,0,0,0,0,0]
[344,0,0,0,0,{"$error":"#DIV/0!"},344,0,0,0,0,null,344,0,0,0,0,0,0]
[345,0,0,0,0,{"$error":"#DIV/0!"},345,0,0,0,0,null,345,0,0,0,0,0,0]
[346,0,0,0,0,{"$error":"#DIV/0!"},346,0,0,0,0,null,346,0,0,0,0,0,0]
[347,0,0,0,0,{"$error":"#DIV/0!"},347,0,0,0,0,null,347,0,0,0,0,0,0]
[348,0,0,0,0,{"$error":"#DIV/0!"},348,0,0,0,0,null,348,0,0,0,0,0,0]
[349,0,0,0,0,{"$error":"#DIV/0!"},349,0,0,0,0,null,349,0,0,0,0,0,0]
[350,0,0,0,0,{"$error":"#DIV/0!"},350,0,0,0,0,null,350,0,0,0,0,0,0]
[351,0,0,0,0,{"$error":"#DIV/0!"},351,0,0,0,0,null,351,0,0,0,0,0,0]
[352,0,0,0,0,{"$error":"#DIV/0!"},352,0,0,0,0,null,352,0,0,0,0,0,0]
[353,0,0,0,0,{"$error":"#DIV/0!"},353,0,0,0,0,null,353,0,0,0,0,0,0]
[354,0,0,0,0,{"$error":"#DIV/0!"},354,0,0,0,0,null,354,0,0,0,0,0,0]
[355,0,0,0,0,{"$error":"#DIV/0!"},355,0,0,0,0,null,355,0,0,0,0,0,0]
[356,0,0,0,0,{"$error":"#DIV/0!"},356,0,0,0,0,null,356,0,0,0,0,0,0]
[357,0,0,0,0,{"$error":"#DIV/0!"},357,0,0,0,0,null,357,0,0,0,0,0,0]
[358,0,0,0,0,{"$error":"#DIV/0!"},358,0,0,0,0,null,358,0,0,0,0,0,0]
[359,0,0,0,0,{"$error":"#DIV/0!"},359,0,0,0,0,null,359,0,0,0,0,0,0]
[360,0,0,0,0,{"$error":"#DIV/0!"},360,0,0,0,0,null,360,0,0,0,0,0,0]
[]
[null,null,null,{"$f":"SUM(D28:D387)","v":0},{"$f":"SUM(E28:E387)","v":0},null,null,null,null,{"$f":"SUM(J28:J387)","v":0},{"$f":"SUM(K28:K387)","v":0},null,null,null,null,{"$f":"SUM(P28:P387)","v":0},{"$f":"SUM(Q28:Q387)","v":0},{"$f":"R27/360","v":0},{"$f":"SUM(S28:S387)","v":0}]
[]
[null,null,null,null,null,null,null,null,null,null,null,null,null,null,null,null,null,null,null,null,null,null,null,null,null,null,{"$f":"P389-S389","v":0}]

{"sheet":"Recapture Calculator","index":4,"n_rows":97,"n_cols":9,"rows_kept":97,"cut":false,"hidden":true,"merged":[[14,1,14,5],[59,0,59,5],[0,0,0,6],[1,0,1,6],[2,0,2,6]]}
["Portland Housing Bureau"]
["Mortgage Credit Certificate"]
["Recapture Tax Estimator"]
[]
["Homeowner Inputs"]
[]
[null,"What was your original loan amount?",null,null,null,null,{"$f":"'MCC Comparison Summary'!C22","v":0}]
[]
[null,"Date you purchased the home.",null,null,null,null,{"$f":"'MCC Data Input'!E7","v":"00:00:00"}]
[null,"Date you intent to sell the home.",null,null,null,null,{"$f":"G9+('MCC Data Input'!G75*365)","v":"00:00:00"}]
[null,"Years of Ownership",null,null,null,null,{"$f":"((YEAR(G10)-YEAR(G9))*12+MONTH(G10)-MONTH(G9))/12","v":0}]
[]
[null,"Number of People in the Household at time of Sale?",null,null,null,null,{"$f":"'MCC Data Input'!G77","v":0}]
[]
[null,"Estimated adjusted gross income (less gains on sale of the subject property) in the year the home is sold?",null,null,null,null,{"$f":"'MCC Data Input'!G76","v":0}]
[]
["Estimated Recapture Tax"]
[]
[null,"Estimated Sale Price",null,null,null,{"$f":"-FV('MCC Data Input'!G78,'MCC Data Input'!G75,0,'MCC Data Input'!E46,0)","v":0}]
[null,"Costs of Sale",null,null,null,{"$f":"F19*'MCC Data Input'!G79","v":0}]
[null,"Original Purchase Price",null,null,null,{"$f":"'MCC Data Input'!E46","v":0}]
[null,"Net Gain on Sale",null,null,null,{"$f":"IF(F19-F20-F21>0,F19-F20-F21,0)","v":0}]
["A","Estimated Gain on Sale Tax (50% of net proceeds)",null,null,null,{"$f":"F22*0.5","v":0}]
[]
[null,null,null,null,null,"MCC","Bond"]
[null,"Loan amount x 6.25% IRS Recapture Rate",null,null,"x",{"$f":"G7*0.0625","v":0},{"$f":"G7*0.0625","v":0}]
[null,"Holding Period Percentage",null,null,"x",{"$f":"VLOOKUP($G$11,Holding_Period,2,TRUE)","v":{"$error":"#N/A"}},{"$f":"VLOOKUP($G$11,Holding_Period,2,TRUE)","v":{"$error":"#N/A"}}]
[null,"Income Percentage",null,null,"x",{"$f":"C67","v":{"$error":"#N/A"}},{"$f":"F67","v":{"$error":"#N/A"}}]
["B","Income Increase Test",null,null,null,{"$f":"F26*F27*F28","v":{"$error":"#N/A"}},{"$f":"G26*G27*G28","v":{"$error":"#N/A"}}]
[]
["C","Maximum Recapture Tax",null,null,null,{"$f":"IF($F$23>F29,F29,$F$23)","v":{"$error":"#N/A"}},{"$f":"IF($F$23>G29,G29,$F$23)","v":{"$error":"#N/A"}}]
[]
["Mortgage Bond Recapture Tax Calculation"]
[]
["Holding Period Percentages"]
["Years of Ownership","Holding Period Percentage"]
[0.99,0.2,null,{"$f":"IF('MCC Data Input'!$E$29<3,+'Recapture Calculator'!B50,+'Recapture Calculator'!C50)","v":73000}]
[1.99,0.4,null,{"$f":"IF('MCC Data Input'!$E$29<3,G50,H50)","v":84000}]
[2.99,0.6]
[3.99,0.8]
[4.99,1]
[5.99,0.8]
[6.99,0.6]
[7.99,0.4]
[8.99,0.2]
[9,0]
[]
["MCC Income Adjustments - 2012",null,null,null,null,"Bond Income Adjustments - 2009"]
["Months of Ownership","1-2 household","3 or more household","% Adjustment to Qual. Income",null,"Months of Ownership","1-2 household","3 or more household","% Adjustment to Qual. Income"]
[0.99,73000,83950,1,null,0.99,84000,98000,1]
[1.99,{"$f":"$B$50*D51","v":76650},{"$f":"$C$50*D51","v":88147.5},1.05,null,1.99,{"$f":"$G$50*I51","v":88200},{"$f":"$H$50*I51","v":102900},1.05]
[2.99,80482.5,92554.875,1.1025,null,2.99,{"$f":"$G$50*I52","v":92610},{"$f":"$H$50*I52","v":108045},1.1025]
[3.99,84506.989999999991,97183.038499999995,1.1576299999999999,null,3.99,97240.92,113447.73999999999,1.1576299999999999]
[4.99,88732.23000000001,102042.06450000001,1.2155100000000001,null,4.99,102102.84000000001,119119.98000000001,1.2155100000000001]
[5.99,93168.44,107143.70600000001,1.2762800000000001,null,5.99,107207.52,125075.44,1.2762800000000001]
[6.99,97827.3,112501.395,1.3401000000000001,null,6.99,112568.40000000001,131329.80000000002,1.3401000000000001]
[7.99,102718.3,118126.045,1.4071,null,7.99,118196.40000000001,137895.79999999999,1.4071]
[8.99,107854.58,124032.76699999999,1.47746,null,8.99,124106.64,144791.07999999999,1.47746]
[9,null,null,null,null,9]
["Income scale is established at MFI in year of purchase"]
["Income Percentage"]
[]
["Modified Adjusted Gross Income",null,{"$f":"'MCC Data Input'!$G$76","v":0},null,null,{"$f":"'MCC Data Input'!$G$76","v":0}]
["less Adjusted Qualified Income",null,{"$f":"IF($G$13<3,VLOOKUP($G$11,A50:C58,2,TRUE),VLOOKUP($G$11,A50:C58,3,TRUE))","v":{"$error":"#N/A"}},null,null,{"$f":"IF($G$13<3,VLOOKUP($G$11,F50:H58,2,TRUE),VLOOKUP($G$11,F50:H58,3,TRUE))","v":{"$error":"#N/A"}}]
["Result",null,{"$f":"IF(C63-C64<0,0,C63-C64)","v":{"$error":"#N/A"}},null,null,{"$f":"IF(F63-F64<0,0,F63-F64)","v":{"$error":"#N/A"}}]
[]
["Income Percentage",null,{"$f":"IF(C65>=5000,1,C65/5000)","v":{"$error":"#N/A"}},null,null,{"$f":"IF(F65>=5000,1,F65/5000)","v":{"$error":"#N/A"}}]
[]
[]
[]
[]
["Name"]
[" "]
["Drop Down Box Data"]
[]
["Yes"]
["No"]
[]
["has"]
["has not"]
[]
["Own"]
["Rent"]
["NA"]
[]
["Existing"]
["New Construction"]
[]
["Male"]
["Female"]
[]
["Married filing Jointly"]
["Single"]
["Head of Household"]
[]
["Hispanic/Latino"]
["Non-Hispanic/Latino"]

{"sheet":"2010 Tax Table and deducts","index":5,"n_rows":4009,"n_cols":13,"rows_kept":4009,"cut":false,"hidden":true,"merged":[]}
[null,"LOOKUPS"]
[null,"SINGLE",{"$f":"VLOOKUP('MCC Comparison Summary'!C$65,Single,3)","v":{"$error":"#N/A"}},{"$f":"VLOOKUP('MCC Comparison Summary'!D$65,Single,3)","v":{"$error":"#N/A"}},{"$f":"VLOOKUP('MCC Comparison Summary'!E$65,Single,3)","v":{"$error":"#N/A"}},"Deductions",3650]
[null,"MARRIED FILING JOINTLY",{"$f":"VLOOKUP('MCC Comparison Summary'!C$65,Married,3)","v":{"$error":"#N/A"}},{"$f":"VLOOKUP('MCC Comparison Summary'!D$65,Married,3)","v":{"$error":"#N/A"}},{"$f":"VLOOKUP('MCC Comparison Summary'!E$65,Married,3)","v":{"$error":"#N/A"}},"Child Tax Credit",1000]
[null,"HEAD OF HOUSEHOLD",{"$f":"VLOOKUP('MCC Comparison Summary'!C$65,Head_of_Household,3)","v":{"$error":"#N/A"}},{"$f":"VLOOKUP('MCC Comparison Summary'!D$65,Head_of_Household,3)","v":{"$error":"#N/A"}},{"$f":"VLOOKUP('MCC Comparison Summary'!E$65,Head_of_Household,3)","v":{"$error":"#N/A"}}]
[]
[null,null,"SINGLE",null,null,"MARRIED FILING JOINTLY",null,null,null,"HEAD OF HOUSEHOLD"]
[null,null,"Tax Rate","Tax "]
[null,"AGI","% Rate","Tax","Chg","AGI","% Rate","Tax","Chg","AGI","% Rate","Tax","Chg"]
[null,0,0,0,0,0,0,0,0,0,0,0,0]
[null,25,0.1,{"$f":"+B10*C10","v":2.5},{"$f":"+D10-D9","v":2.5},25,0.1,{"$f":"+F10*G10","v":2.5},{"$f":"+H10-H9","v":2.5},25,0.1,{"$f":"+J10*K10","v":2.5},{"$f":"+L10-L9","v":2.5}]
[null,50,0.1,5,2.5,50,0.1,5,2.5,50,0.1,5,2.5]
[null,75,0.1,7.5,2.5,75,0.1,7.5,2.5,75,0.1,7.5,2.5]
[null,100,0.1,10,2.5,100,0.1,10,2.5,100,0.1,10,2.5]
[null,125,0.1,12.5,2.5,125,0.1,12.5,2.5,125,0.1,12.5,2.5]
[null,150,0.1,15,2.5,150,0.1,15,2.5,150,0.1,15,2.5]
[null,175,0.1,17.5,2.5,175,0.1,17.5,2.5,175,0.1,17.5,2.5]
[null,200,0.1,20,2.5,200,0.1,20,2.5,200,0.1,20,2.5]
[null,225,0.1,22.5,2.5,225,0.1,22.5,2.5,225,0.1,22.5,2.5]
[null,250,0.1,25,2.5,250,0.1,25,2.5,250,0.1,25,2.5]
[null,275,0.1,27.5,2.5,275,0.1,27.5,2.5,275,0.1,27.5,2.5]
[null,300,0.1,30,2.5,300,0.1,30,2.5,300,0.1,30,2.5]
[null,325,0.1,32.5,2.5,325,0.1,32.5,2.5,325,0.1,32.5,2.5]
[null,350,0.1,35,2.5,350,0.1,35,2.5,350,0.1,35,2.5]
[null,375,0.1,37.5,2.5,375,0.1,37.5,2.5,375,0.1,37.5,2.5]
[null,400,0.1,40,2.5,400,0.1,40,2.5,400,0.1,40,2.5]
[null,425,0.1,42.5,2.5,425,0.1,42.5,2.5,425,0.1,42.5,2.5]
[null,450,0.1,45,2.5,450,0.1,45,2.5,450,0.1,45,2.5]
[null,475,0.1,47.5,2.5,475,0.1,47.5,2.5,475,0.1,47.5,2.5]
[null,500,0.1,50,2.5,500,0.1,50,2.5,500,0.1,50,2.5]
[null,525,0.1,52.5,2.5,525,0.1,52.5,2.5,525,0.1,52.5,2.5]
[null,550,0.1,55,2.5,550,0.1,55,2.5,550,0.1,55,2.5]
[null,575,0.1,57.5,2.5,575,0.1,57.5,2.5,575,0.1,57.5,2.5]
[null,600,0.1,60,2.5,600,0.1,60,2.5,600,0.1,60,2.5]
[null,625,0.1,62.5,2.5,625,0.1,62.5,2.5,625,0.1,62.5,2.5]
[null,650,0.1,65,2.5,650,0.1,65,2.5,650,0.1,65,2.5]
[null,675,0.1,67.5,2.5,675,0.1,67.5,2.5,675,0.1,67.5,2.5]
[null,700,0.1,70,2.5,700,0.1,70,2.5,700,0.1,70,2.5]
[null,725,0.1,72.5,2.5,725,0.1,72.5,2.5,725,0.1,72.5,2.5]
[null,750,0.1,75,2.5,750,0.1,75,2.5,750,0.1,75,2.5]
[null,775,0.1,77.5,2.5,775,0.1,77.5,2.5,775,0.1,77.5,2.5]
[null,800,0.1,80,2.5,800,0.1,80,2.5,800,0.1,80,2.5]
[null,825,0.1,82.5,{"$f":"+D42-D41","v":2.5},825,0.1,82.5,2.5,825,0.1,82.5,2.5]
[null,850,0.1,85,2.5,850,0.1,85,2.5,850,0.1,85,2.5]
[null,875,0.1,87.5,2.5,875,0.1,87.5,2.5,875,0.1,87.5,2.5]
[null,900,0.1,90,2.5,900,0.1,90,2.5,900,0.1,90,2.5]
[null,925,0.1,92.5,2.5,925,0.1,92.5,2.5,925,0.1,92.5,2.5]
[null,950,0.1,95,2.5,950,0.1,95,2.5,950,0.1,95,2.5]
[null,975,0.1,97.5,2.5,975,0.1,97.5,2.5,975,0.1,97.5,2.5]
[null,1000,0.1,100,2.5,1000,0.1,100,2.5,1000,0.1,100,2.5]
[null,1025,0.1,102.5,2.5,1025,0.1,102.5,2.5,1025,0.1,102.5,2.5]
[null,1050,0.1,105,2.5,1050,0.1,105,2.5,1050,0.1,105,2.5]
[null,1075,0.1,107.5,2.5,1075,0.1,107.5,2.5,1075,0.1,107.5,2.5]
[null,1100,0.1,110,2.5,1100,0.1,110,2.5,1100,0.1,110,2.5]
[null,1125,0.1,112.5,2.5,1125,0.1,112.5,2.5,1125,0.1,112.5,2.5]
[null,1150,0.1,115,2.5,1150,0.1,115,2.5,1150,0.1,115,2.5]
[null,1175,0.1,117.5,2.5,1175,0.1,117.5,2.5,1175,0.1,117.5,2.5]
[null,1200,0.1,120,2.5,1200,0.1,120,2.5,1200,0.1,120,2.5]
[null,1225,0.1,122.5,2.5,1225,0.1,122.5,2.5,1225,0.1,122.5,2.5]
[null,1250,0.1,125,2.5,1250,0.1,125,2.5,1250,0.1,125,2.5]
[null,1275,0.1,127.5,2.5,1275,0.1,127.5,2.5,1275,0.1,127.5,2.5]
[null,1300,0.1,130,2.5,1300,0.1,130,2.5,1300,0.1,130,2.5]
[null,1325,0.1,132.5,2.5,1325,0.1,132.5,2.5,1325,0.1,132.5,2.5]
[null,1350,0.1,135,2.5,1350,0.1,135,2.5,1350,0.1,135,2.5]
[null,1375,0.1,137.5,2.5,1375,0.1,137.5,2.5,1375,0.1,137.5,2.5]
[null,1400,0.1,140,2.5,1400,0.1,140,2.5,1400,0.1,140,2.5]
[null,1425,0.1,142.5,2.5,1425,0.1,142.5,2.5,1425,0.1,142.5,2.5]
[null,1450,0.1,145,2.5,1450,0.1,145,2.5,1450,0.1,145,2.5]
[null,1475,0.1,147.5,2.5,1475,0.1,147.5,2.5,1475,0.1,147.5,2.5]
[null,1500,0.1,150,2.5,1500,0.1,150,2.5,1500,0.1,150,2.5]
[null,1525,0.1,152.5,2.5,1525,0.1,152.5,2.5,1525,0.1,152.5,2.5]
[null,1550,0.1,155,2.5,1550,0.1,155,2.5,1550,0.1,155,2.5]
[null,1575,0.1,157.5,2.5,1575,0.1,157.5,2.5,1575,0.1,157.5,2.5]
[null,1600,0.1,160,2.5,1600,0.1,160,2.5,1600,0.1,160,2.5]
[null,1625,0.1,{"$f":"+B74*C74","v":162.5},{"$f":"+D74-D73","v":2.5},1625,0.1,{"$f":"+F74*G74","v":162.5},{"$f":"+H74-H73","v":2.5},1625,0.1,{"$f":"+J74*K74","v":162.5},{"$f":"+L74-L73","v":2.5}]
[null,1650,0.1,165,2.5,1650,0.1,165,2.5,1650,0.1,165,2.5]
[null,1675,0.1,167.5,2.5,1675,0.1,167.5,2.5,1675,0.1,167.5,2.5]
[null,1700,0.1,170,2.5,1700,0.1,170,2.5,1700,0.1,170,2.5]
[null,1725,0.1,172.5,2.5,1725,0.1,172.5,2.5,1725,0.1,172.5,2.5]
[null,1750,0.1,175,2.5,1750,0.1,175,2.5,1750,0.1,175,2.5]
[null,1775,0.1,177.5,2.5,1775,0.1,177.5,2.5,1775,0.1,177.5,2.5]
[null,1800,0.1,180,2.5,1800,0.1,180,2.5,1800,0.1,180,2.5]
[null,1825,0.1,182.5,2.5,1825,0.1,182.5,2.5,1825,0.1,182.5,2.5]
[null,1850,0.1,185,2.5,1850,0.1,185,2.5,1850,0.1,185,2.5]
[null,1875,0.1,187.5,2.5,1875,0.1,187.5,2.5,1875,0.1,187.5,2.5]
[null,1900,0.1,190,2.5,1900,0.1,190,2.5,1900,0.1,190,2.5]
[null,1925,0.1,192.5,2.5,1925,0.1,192.5,2.5,1925,0.1,192.5,2.5]
[null,1950,0.1,195,2.5,1950,0.1,195,2.5,1950,0.1,195,2.5]
[null,1975,0.1,197.5,2.5,1975,0.1,197.5,2.5,1975,0.1,197.5,2.5]
[null,2000,0.1,200,2.5,2000,0.1,200,2.5,2000,0.1,200,2.5]
[null,2025,0.1,202.5,2.5,2025,0.1,202.5,2.5,2025,0.1,202.5,2.5]
[null,2050,0.1,205,2.5,2050,0.1,205,2.5,2050,0.1,205,2.5]
[null,2075,0.1,207.5,2.5,2075,0.1,207.5,2.5,2075,0.1,207.5,2.5]
[null,2100,0.1,210,2.5,2100,0.1,210,2.5,2100,0.1,210,2.5]
[null,2125,0.1,212.5,2.5,2125,0.1,212.5,2.5,2125,0.1,212.5,2.5]
[null,2150,0.1,215,2.5,2150,0.1,215,2.5,2150,0.1,215,2.5]
[null,2175,0.1,217.5,2.5,2175,0.1,217.5,2.5,2175,0.1,217.5,2.5]
[null,2200,0.1,220,2.5,2200,0.1,220,2.5,2200,0.1,220,2.5]
[null,2225,0.1,222.5,2.5,2225,0.1,222.5,2.5,2225,0.1,222.5,2.5]
[null,2250,0.1,225,2.5,2250,0.1,225,2.5,2250,0.1,225,2.5]
[null,2275,0.1,227.5,2.5,2275,0.1,227.5,2.5,2275,0.1,227.5,2.5]
[null,2300,0.1,230,2.5,2300,0.1,230,2.5,2300,0.1,230,2.5]
[null,2325,0.1,232.5,2.5,2325,0.1,232.5,2.5,2325,0.1,232.5,2.5]
[null,2350,0.1,235,2.5,2350,0.1,235,2.5,2350,0.1,235,2.5]
[null,2375,0.1,237.5,2.5,2375,0.1,237.5,2.5,2375,0.1,237.5,2.5]
[null,2400,0.1,240,2.5,2400,0.1,240,2.5,2400,0.1,240,2.5]
[null,2425,0.1,242.5,{"$f":"+D106-D105","v":2.5},2425,0.1,242.5,2.5,2425,0.1,242.5,2.5]
[null,2450,0.1,245,2.5,2450,0.1,245,2.5,2450,0.1,245,2.5]
[null,2475,0.1,247.5,2.5,2475,0.1,247.5,2.5,2475,0.1,247.5,2.5]
[null,2500,0.1,250,2.5,2500,0.1,250,2.5,2500,0.1,250,2.5]
[null,2525,0.1,252.5,2.5,2525,0.1,252.5,2.5,2525,0.1,252.5,2.5]
[null,2550,0.1,255,2.5,2550,0.1,255,2.5,2550,0.1,255,2.5]
[null,2575,0.1,257.5,2.5,2575,0.1,257.5,2.5,2575,0.1,257.5,2.5]
[null,2600,0.1,260,2.5,2600,0.1,260,2.5,2600,0.1,260,2.5]
[null,2625,0.1,262.5,2.5,2625,0.1,262.5,2.5,2625,0.1,262.5,2.5]
[null,2650,0.1,265,2.5,2650,0.1,265,2.5,2650,0.1,265,2.5]
[null,2675,0.1,267.5,{"$f":"M116","v":2.5},2675,0.1,267.5,2.5,2675,0.1,267.5,2.5]
[null,2700,0.1,270,{"$f":"+D117-D116","v":2.5},2700,0.1,270,2.5,2700,0.1,270,2.5]
[null,2725,0.1,272.5,2.5,2725,0.1,272.5,2.5,2725,0.1,272.5,2.5]
[null,2750,0.1,275,2.5,2750,0.1,275,2.5,2750,0.1,275,2.5]
[null,2775,0.1,277.5,2.5,2775,0.1,277.5,2.5,2775,0.1,277.5,2.5]
[null,2800,0.1,280,2.5,2800,0.1,280,2.5,2800,0.1,280,2.5]
[null,2825,0.1,282.5,2.5,2825,0.1,282.5,2.5,2825,0.1,282.5,2.5]
[null,2850,0.1,285,2.5,2850,0.1,285,2.5,2850,0.1,285,2.5]
[null,2875,0.1,287.5,2.5,2875,0.1,287.5,2.5,2875,0.1,287.5,2.5]
[null,2900,0.1,290,2.5,2900,0.1,290,2.5,2900,0.1,290,2.5]
[null,2925,0.1,292.5,2.5,2925,0.1,292.5,2.5,2925,0.1,292.5,2.5]
[null,2950,0.1,295,2.5,2950,0.1,295,2.5,2950,0.1,295,2.5]
[null,2975,0.1,297.5,2.5,2975,0.1,297.5,2.5,2975,0.1,297.5,2.5]
[null,3000,0.1,300,2.5,3000,0.1,300,2.5,3000,0.1,300,2.5]
[null,3025,0.1,302.5,2.5,3025,0.1,302.5,2.5,3025,0.1,302.5,2.5]
[null,3050,0.1,305,2.5,3050,0.1,305,2.5,3050,0.1,305,2.5]
[null,3075,0.1,307.5,2.5,3075,0.1,307.5,2.5,3075,0.1,307.5,2.5]
[null,3100,0.1,310,2.5,3100,0.1,310,2.5,3100,0.1,310,2.5]
[null,3125,0.1,312.5,2.5,3125,0.1,312.5,2.5,3125,0.1,312.5,2.5]
[null,3150,0.1,315,2.5,3150,0.1,315,2.5,3150,0.1,315,2.5]
[null,3175,0.1,317.5,2.5,3175,0.1,317.5,2.5,3175,0.1,317.5,2.5]
[null,3200,0.1,320,2.5,3200,0.1,320,2.5,3200,0.1,320,2.5]
[null,3225,0.1,{"$f":"+B138*C138","v":322.5},2.5,3225,0.1,{"$f":"+F138*G138","v":322.5},{"$f":"+H138-H137","v":2.5},3225,0.1,{"$f":"+J138*K138","v":322.5},{"$f":"+L138-L137","v":2.5}]
[null,3250,0.1,325,2.5,3250,0.1,325,2.5,3250,0.1,325,2.5]
[null,3275,0.1,327.5,2.5,3275,0.1,327.5,2.5,3275,0.1,327.5,2.5]
[null,3300,0.1,330,2.5,3300,0.1,330,2.5,3300,0.1,330,2.5]
[null,3325,0.1,332.5,2.5,3325,0.1,332.5,2.5,3325,0.1,332.5,2.5]
[null,3350,0.1,335,2.5,3350,0.1,335,2.5,3350,0.1,335,2.5]
[null,3375,0.1,337.5,2.5,3375,0.1,337.5,2.5,3375,0.1,337.5,2.5]
[null,3400,0.1,340,2.5,3400,0.1,340,2.5,3400,0.1,340,2.5]
[null,3425,0.1,342.5,2.5,3425,0.1,342.5,2.5,3425,0.1,342.5,2.5]
[null,3450,0.1,345,2.5,3450,0.1,345,2.5,3450,0.1,345,2.5]
[null,3475,0.1,347.5,2.5,3475,0.1,347.5,2.5,3475,0.1,347.5,2.5]
[null,3500,0.1,350,2.5,3500,0.1,350,2.5,3500,0.1,350,2.5]
[null,3525,0.1,352.5,2.5,3525,0.1,352.5,2.5,3525,0.1,352.5,2.5]
[null,3550,0.1,355,2.5,3550,0.1,355,2.5,3550,0.1,355,2.5]
[null,3575,0.1,357.5,2.5,3575,0.1,357.5,2.5,3575,0.1,357.5,2.5]
[null,3600,0.1,360,2.5,3600,0.1,360,2.5,3600,0.1,360,2.5]
[null,3625,0.1,362.5,2.5,3625,0.1,362.5,2.5,3625,0.1,362.5,2.5]
[null,3650,0.1,365,2.5,3650,0.1,365,2.5,3650,0.1,365,2.5]
[null,3675,0.1,367.5,2.5,3675,0.1,367.5,2.5,3675,0.1,367.5,2.5]
[null,3700,0.1,370,2.5,3700,0.1,370,2.5,3700,0.1,370,2.5]
[null,3725,0.1,372.5,2.5,3725,0.1,372.5,2.5,3725,0.1,372.5,2.5]
[null,3750,0.1,375,2.5,3750,0.1,375,2.5,3750,0.1,375,2.5]
[null,3775,0.1,377.5,2.5,3775,0.1,377.5,2.5,3775,0.1,377.5,2.5]
[null,3800,0.1,380,2.5,3800,0.1,380,2.5,3800,0.1,380,2.5]
[null,3825,0.1,382.5,2.5,3825,0.1,382.5,2.5,3825,0.1,382.5,2.5]
[null,3850,0.1,385,2.5,3850,0.1,385,2.5,3850,0.1,385,2.5]
[null,3875,0.1,387.5,2.5,3875,0.1,387.5,2.5,3875,0.1,387.5,2.5]
[null,3900,0.1,390,2.5,3900,0.1,390,2.5,3900,0.1,390,2.5]
[null,3925,0.1,392.5,2.5,3925,0.1,392.5,2.5,3925,0.1,392.5,2.5]
[null,3950,0.1,395,2.5,3950,0.1,395,2.5,3950,0.1,395,2.5]
[null,3975,0.1,397.5,2.5,3975,0.1,397.5,2.5,3975,0.1,397.5,2.5]
[null,4000,0.1,400,2.5,4000,0.1,400,2.5,4000,0.1,400,2.5]
[null,4025,0.1,402.5,2.5,4025,0.1,402.5,2.5,4025,0.1,402.5,2.5]
[null,4050,0.1,405,2.5,4050,0.1,405,2.5,4050,0.1,405,2.5]
[null,4075,0.1,407.5,2.5,4075,0.1,407.5,2.5,4075,0.1,407.5,2.5]
[null,4100,0.1,410,2.5,4100,0.1,410,2.5,4100,0.1,410,2.5]
[null,4125,0.1,412.5,2.5,4125,0.1,412.5,2.5,4125,0.1,412.5,2.5]
[null,4150,0.1,415,2.5,4150,0.1,415,2.5,4150,0.1,415,2.5]
[null,4175,0.1,417.5,2.5,4175,0.1,417.5,2.5,4175,0.1,417.5,2.5]
[null,4200,0.1,420,2.5,4200,0.1,420,2.5,4200,0.1,420,2.5]
[null,4225,0.1,422.5,2.5,4225,0.1,422.5,2.5,4225,0.1,422.5,2.5]
[null,4250,0.1,425,2.5,4250,0.1,425,2.5,4250,0.1,425,2.5]
[null,4275,0.1,427.5,2.5,4275,0.1,427.5,2.5,4275,0.1,427.5,2.5]
[null,4300,0.1,430,{"$f":"+D181-D180","v":2.5},4300,0.1,430,2.5,4300,0.1,430,2.5]
[null,4325,0.1,432.5,2.5,4325,0.1,432.5,2.5,4325,0.1,432.5,2.5]
[null,4350,0.1,435,2.5,4350,0.1,435,2.5,4350,0.1,435,2.5]
[null,4375,0.1,437.5,2.5,4375,0.1,437.5,2.5,4375,0.1,437.5,2.5]
[null,4400,0.1,440,2.5,4400,0.1,440,2.5,4400,0.1,440,2.5]
[null,4425,0.1,442.5,2.5,4425,0.1,442.5,2.5,4425,0.1,442.5,2.5]
[null,4450,0.1,445,2.5,4450,0.1,445,2.5,4450,0.1,445,2.5]
[null,4475,0.1,447.5,2.5,4475,0.1,447.5,2.5,4475,0.1,447.5,2.5]
[null,4500,0.1,450,2.5,4500,0.1,450,2.5,4500,0.1,450,2.5]
[null,4525,0.1,452.5,2.5,4525,0.1,452.5,2.5,4525,0.1,452.5,2.5]
[null,4550,0.1,455,2.5,4550,0.1,455,2.5,4550,0.1,455,2.5]
[null,4575,0.1,457.5,2.5,4575,0.1,457.5,2.5,4575,0.1,457.5,2.5]
[null,4600,0.1,460,2.5,4600,0.1,460,2.5,4600,0.1,460,2.5]
[null,4625,0.1,462.5,2.5,4625,0.1,462.5,2.5,4625,0.1,462.5,2.5]
[null,4650,0.1,465,2.5,4650,0.1,465,2.5,4650,0.1,465,2.5]
[null,4675,0.1,467.5,2.5,4675,0.1,467.5,2.5,4675,0.1,467.5,2.5]
[null,4700,0.1,470,2.5,4700,0.1,470,2.5,4700,0.1,470,2.5]
[null,4725,0.1,472.5,2.5,4725,0.1,472.5,2.5,4725,0.1,472.5,2.5]
[null,4750,0.1,475,2.5,4750,0.1,475,2.5,4750,0.1,475,2.5]
[null,4775,0.1,477.5,2.5,4775,0.1,477.5,2.5,4775,0.1,477.5,2.5]
[null,4800,0.1,480,2.5,4800,0.1,480,2.5,4800,0.1,480,2.5]
[null,4825,0.1,{"$f":"+B202*C202","v":482.5},2.5,4825,0.1,{"$f":"+F202*G202","v":482.5},{"$f":"+H202-H201","v":2.5},4825,0.1,{"$f":"+J202*K202","v":482.5},{"$f":"+L202-L201","v":2.5}]
[null,4850,0.1,485,2.5,4850,0.1,485,2.5,4850,0.1,485,2.5]
[null,4875,0.1,487.5,2.5,4875,0.1,487.5,2.5,4875,0.1,487.5,2.5]
[null,4900,0.1,490,2.5,4900,0.1,490,2.5,4900,0.1,490,2.5]
[null,4925,0.1,492.5,2.5,4925,0.1,492.5,2.5,4925,0.1,492.5,2.5]
[null,4950,0.1,495,2.5,4950,0.1,495,2.5,4950,0.1,495,2.5]
[null,4975,0.1,497.5,2.5,4975,0.1,497.5,2.5,4975,0.1,497.5,2.5]
[null,5000,0.1,500,2.5,5000,0.1,500,2.5,5000,0.1,500,2.5]
[null,5025,0.1,502.5,2.5,5025,0.1,502.5,2.5,5025,0.1,502.5,2.5]
[null,5050,0.1,505,2.5,5050,0.1,505,2.5,5050,0.1,505,2.5]
[null,5075,0.1,507.5,2.5,5075,0.1,507.5,2.5,5075,0.1,507.5,2.5]
[null,5100,0.1,510,2.5,5100,0.1,510,2.5,5100,0.1,510,2.5]
[null,5125,0.1,512.5,2.5,5125,0.1,512.5,2.5,5125,0.1,512.5,2.5]
[null,5150,0.1,515,2.5,5150,0.1,515,2.5,5150,0.1,515,2.5]
[null,5175,0.1,517.5,2.5,5175,0.1,517.5,2.5,5175,0.1,517.5,2.5]
[null,5200,0.1,520,2.5,5200,0.1,520,2.5,5200,0.1,520,2.5]
[null,5225,0.1,522.5,2.5,5225,0.1,522.5,2.5,5225,0.1,522.5,2.5]
[null,5250,0.1,525,2.5,5250,0.1,525,2.5,5250,0.1,525,2.5]
[null,5275,0.1,527.5,2.5,5275,0.1,527.5,2.5,5275,0.1,527.5,2.5]
[null,5300,0.1,530,2.5,5300,0.1,530,2.5,5300,0.1,530,2.5]
[null,5325,0.1,532.5,2.5,5325,0.1,532.5,2.5,5325,0.1,532.5,2.5]
[null,5350,0.1,535,2.5,5350,0.1,535,2.5,5350,0.1,535,2.5]
[null,5375,0.1,537.5,2.5,5375,0.1,537.5,2.5,5375,0.1,537.5,2.5]
[null,5400,0.1,540,2.5,5400,0.1,540,2.5,5400,0.1,540,2.5]
[null,5425,0.1,542.5,2.5,5425,0.1,542.5,2.5,5425,0.1,542.5,2.5]
[null,5450,0.1,545,2.5,5450,0.1,545,2.5,5450,0.1,545,2.5]
[null,5475,0.1,547.5,2.5,5475,0.1,547.5,2.5,5475,0.1,547.5,2.5]
[null,5500,0.1,550,2.5,5500,0.1,550,2.5,5500,0.1,550,2.5]
[null,5525,0.1,552.5,2.5,5525,0.1,552.5,2.5,5525,0.1,552.5,2.5]
[null,5550,0.1,555,2.5,5550,0.1,555,2.5,5550,0.1,555,2.5]
[null,5575,0.1,557.5,2.5,5575,0.1,557.5,2.5,5575,0.1,557.5,2.5]
[null,5600,0.1,560,2.5,5600,0.1,560,2.5,5600,0.1,560,2.5]
[null,5625,0.1,562.5,2.5,5625,0.1,562.5,2.5,5625,0.1,562.5,2.5]
[null,5650,0.1,565,2.5,5650,0.1,565,2.5,5650,0.1,565,2.5]
[null,5675,0.1,567.5,2.5,5675,0.1,567.5,2.5,5675,0.1,567.5,2.5]
[null,5700,0.1,570,2.5,5700,0.1,570,2.5,5700,0.1,570,2.5]
[null,5725,0.1,572.5,2.5,5725,0.1,572.5,2.5,5725,0.1,572.5,2.5]
[null,5750,0.1,575,2.5,5750,0.1,575,2.5,5750,0.1,575,2.5]
[null,5775,0.1,577.5,2.5,5775,0.1,577.5,2.5,5775,0.1,577.5,2.5]
[null,5800,0.1,580,2.5,5800,0.1,580,2.5,5800,0.1,580,2.5]
[null,5825,0.1,582.5,2.5,5825,0.1,582.5,2.5,5825,0.1,582.5,2.5]
[null,5850,0.1,585,2.5,5850,0.1,585,2.5,5850,0.1,585,2.5]
[null,5875,0.1,587.5,2.5,5875,0.1,587.5,2.5,5875,0.1,587.5,2.5]
[null,5900,0.1,590,{"$f":"+D245-D244","v":2.5},5900,0.1,590,2.5,5900,0.1,590,2.5]
[null,5925,0.1,592.5,2.5,5925,0.1,592.5,2.5,5925,0.1,592.5,2.5]
[null,5950,0.1,595,2.5,5950,0.1,595,2.5,5950,0.1,595,2.5]
[null,5975,0.1,597.5,2.5,5975,0.1,597.5,2.5,5975,0.1,597.5,2.5]
[null,6000,0.1,600,2.5,6000,0.1,600,2.5,6000,0.1,600,2.5]
[null,6025,0.1,602.5,2.5,6025,0.1,602.5,2.5,6025,0.1,602.5,2.5]
[null,6050,0.1,605,2.5,6050,0.1,605,2.5,6050,0.1,605,2.5]
[null,6075,0.1,607.5,2.5,6075,0.1,607.5,2.5,6075,0.1,607.5,2.5]
[null,6100,0.1,610,2.5,6100,0.1,610,2.5,6100,0.1,610,2.5]
[null,6125,0.1,612.5,2.5,6125,0.1,612.5,2.5,6125,0.1,612.5,2.5]
[null,6150,0.1,615,2.5,6150,0.1,615,2.5,6150,0.1,615,2.5]
[null,6175,0.1,617.5,2.5,6175,0.1,617.5,2.5,6175,0.1,617.5,2.5]
[null,6200,0.1,620,2.5,6200,0.1,620,2.5,6200,0.1,620,2.5]
[null,6225,0.1,622.5,2.5,6225,0.1,622.5,2.5,6225,0.1,622.5,2.5]
[null,6250,0.1,625,2.5,6250,0.1,625,2.5,6250,0.1,625,2.5]
[null,6275,0.1,627.5,2.5,6275,0.1,627.5,2.5,6275,0.1,627.5,2.5]
[null,6300,0.1,630,2.5,6300,0.1,630,2.5,6300,0.1,630,2.5]
[null,6325,0.1,632.5,2.5,6325,0.1,632.5,2.5,6325,0.1,632.5,2.5]
[null,6350,0.1,635,2.5,6350,0.1,635,2.5,6350,0.1,635,2.5]
[null,6375,0.1,637.5,2.5,6375,0.1,637.5,2.5,6375,0.1,637.5,2.5]
[null,6400,0.1,640,2.5,6400,0.1,640,2.5,6400,0.1,640,2.5]
[null,6425,0.1,{"$f":"+B266*C266","v":642.5},2.5,6425,0.1,{"$f":"+F266*G266","v":642.5},{"$f":"+H266-H265","v":2.5},6425,0.1,{"$f":"+J266*K266","v":642.5},{"$f":"+L266-L265","v":2.5}]
[null,6450,0.1,645,2.5,6450,0.1,645,2.5,6450,0.1,645,2.5]
[null,6475,0.1,647.5,2.5,6475,0.1,647.5,2.5,6475,0.1,647.5,2.5]
[null,6500,0.1,650,2.5,6500,0.1,650,2.5,6500,0.1,650,2.5]
[null,6525,0.1,652.5,2.5,6525,0.1,652.5,2.5,6525,0.1,652.5,2.5]
[null,6550,0.1,655,2.5,6550,0.1,655,2.5,6550,0.1,655,2.5]
[null,6575,0.1,657.5,2.5,6575,0.1,657.5,2.5,6575,0.1,657.5,2.5]
[null,6600,0.1,660,2.5,6600,0.1,660,2.5,6600,0.1,660,2.5]
[null,6625,0.1,662.5,2.5,6625,0.1,662.5,2.5,6625,0.1,662.5,2.5]
[null,6650,0.1,665,2.5,6650,0.1,665,2.5,6650,0.1,665,2.5]
[null,6675,0.1,667.5,2.5,6675,0.1,667.5,2.5,6675,0.1,667.5,2.5]
[null,6700,0.1,670,2.5,6700,0.1,670,2.5,6700,0.1,670,2.5]
[null,6725,0.1,672.5,2.5,6725,0.1,672.5,2.5,6725,0.1,672.5,2.5]
[null,6750,0.1,675,2.5,6750,0.1,675,2.5,6750,0.1,675,2.5]
[null,6775,0.1,677.5,2.5,6775,0.1,677.5,2.5,6775,0.1,677.5,2.5]
[null,6800,0.1,680,2.5,6800,0.1,680,2.5,6800,0.1,680,2.5]
[null,6825,0.1,682.5,2.5,6825,0.1,682.5,2.5,6825,0.1,682.5,2.5]
[null,6850,0.1,685,2.5,6850,0.1,685,2.5,6850,0.1,685,2.5]
[null,6875,0.1,687.5,2.5,6875,0.1,687.5,2.5,6875,0.1,687.5,2.5]
[null,6900,0.1,690,2.5,6900,0.1,690,2.5,6900,0.1,690,2.5]
[null,6925,0.1,692.5,2.5,6925,0.1,692.5,2.5,6925,0.1,692.5,2.5]
[null,6950,0.1,695,2.5,6950,0.1,695,2.5,6950,0.1,695,2.5]
[null,6975,0.1,697.5,2.5,6975,0.1,697.5,2.5,6975,0.1,697.5,2.5]
[null,7000,0.1,700,2.5,7000,0.1,700,2.5,7000,0.1,700,2.5]
[null,7025,0.1,702.5,2.5,7025,0.1,702.5,2.5,7025,0.1,702.5,2.5]
[null,7050,0.1,705,2.5,7050,0.1,705,2.5,7050,0.1,705,2.5]
[null,7075,0.1,707.5,2.5,7075,0.1,707.5,2.5,7075,0.1,707.5,2.5]
[null,7100,0.1,710,2.5,7100,0.1,710,2.5,7100,0.1,710,2.5]
[null,7125,0.1,712.5,2.5,7125,0.1,712.5,2.5,7125,0.1,712.5,2.5]
[null,7150,0.1,715,2.5,7150,0.1,715,2.5,7150,0.1,715,2.5]
[null,7175,0.1,717.5,2.5,7175,0.1,717.5,2.5,7175,0.1,717.5,2.5]
[null,7200,0.1,720,2.5,7200,0.1,720,2.5,7200,0.1,720,2.5]
[null,7225,0.1,722.5,2.5,7225,0.1,722.5,2.5,7225,0.1,722.5,2.5]
[null,7250,0.1,725,2.5,7250,0.1,725,2.5,7250,0.1,725,2.5]
[null,7275,0.1,727.5,2.5,7275,0.1,727.5,2.5,7275,0.1,727.5,2.5]
[null,7300,0.1,730,2.5,7300,0.1,730,2.5,7300,0.1,730,2.5]
[null,7325,0.1,732.5,2.5,7325,0.1,732.5,2.5,7325,0.1,732.5,2.5]
[null,7350,0.1,735,2.5,7350,0.1,735,2.5,7350,0.1,735,2.5]
[null,7375,0.1,737.5,2.5,7375,0.1,737.5,2.5,7375,0.1,737.5,2.5]
[null,7400,0.1,740,2.5,7400,0.1,740,2.5,7400,0.1,740,2.5]
[null,7425,0.1,742.5,2.5,7425,0.1,742.5,2.5,7425,0.1,742.5,2.5]
[null,7450,0.1,745,2.5,7450,0.1,745,2.5,7450,0.1,745,2.5]
[null,7475,0.1,747.5,2.5,7475,0.1,747.5,2.5,7475,0.1,747.5,2.5]
[null,7500,0.1,750,{"$f":"+D309-D308","v":2.5},7500,0.1,750,2.5,7500,0.1,750,2.5]
[null,7525,0.1,752.5,2.5,7525,0.1,752.5,2.5,7525,0.1,752.5,2.5]
[null,7550,0.1,755,2.5,7550,0.1,755,2.5,7550,0.1,755,2.5]
[null,7575,0.1,757.5,2.5,7575,0.1,757.5,2.5,7575,0.1,757.5,2.5]
[null,7600,0.1,760,2.5,7600,0.1,760,2.5,7600,0.1,760,2.5]
[null,7625,0.1,762.5,2.5,7625,0.1,762.5,2.5,7625,0.1,762.5,2.5]
[null,7650,0.1,765,2.5,7650,0.1,765,2.5,7650,0.1,765,2.5]
[null,7675,0.1,767.5,2.5,7675,0.1,767.5,2.5,7675,0.1,767.5,2.5]
[null,7700,0.1,770,2.5,7700,0.1,770,2.5,7700,0.1,770,2.5]
[null,7725,0.1,772.5,2.5,7725,0.1,772.5,2.5,7725,0.1,772.5,2.5]
[null,7750,0.1,775,2.5,7750,0.1,775,2.5,7750,0.1,775,2.5]
[null,7775,0.1,777.5,2.5,7775,0.1,777.5,2.5,7775,0.1,777.5,2.5]
[null,7800,0.1,780,2.5,7800,0.1,780,2.5,7800,0.1,780,2.5]
[null,7825,0.1,782.5,2.5,7825,0.1,782.5,2.5,7825,0.1,782.5,2.5]
[null,7850,0.1,785,2.5,7850,0.1,785,2.5,7850,0.1,785,2.5]
[null,7875,0.1,787.5,2.5,7875,0.1,787.5,2.5,7875,0.1,787.5,2.5]
[null,7900,0.1,790,2.5,7900,0.1,790,2.5,7900,0.1,790,2.5]
[null,7925,0.1,792.5,2.5,7925,0.1,792.5,2.5,7925,0.1,792.5,2.5]
[null,7950,0.1,795,2.5,7950,0.1,795,2.5,7950,0.1,795,2.5]
[null,7975,0.1,797.5,2.5,7975,0.1,797.5,2.5,7975,0.1,797.5,2.5]
[null,8000,0.1,800,2.5,8000,0.1,800,2.5,8000,0.1,800,2.5]
[null,8025,0.1,{"$f":"+B330*C330","v":802.5},2.5,8025,0.1,{"$f":"+F330*G330","v":802.5},{"$f":"+H330-H329","v":2.5},8025,0.1,{"$f":"+J330*K330","v":802.5},{"$f":"+L330-L329","v":2.5}]
[null,8050,0.1,805,2.5,8050,0.1,805,2.5,8050,0.1,805,2.5]
[null,8075,0.1,807.5,2.5,8075,0.1,807.5,2.5,8075,0.1,807.5,2.5]
[null,8100,0.1,810,2.5,8100,0.1,810,2.5,8100,0.1,810,2.5]
[null,8125,0.1,812.5,2.5,8125,0.1,812.5,2.5,8125,0.1,812.5,2.5]
[null,8150,0.1,815,2.5,8150,0.1,815,2.5,8150,0.1,815,2.5]
[null,8175,0.1,817.5,2.5,8175,0.1,817.5,2.5,8175,0.1,817.5,2.5]
[null,8200,0.1,820,2.5,8200,0.1,820,2.5,8200,0.1,820,2.5]
[null,8225,0.1,822.5,2.5,8225,0.1,822.5,2.5,8225,0.1,822.5,2.5]
[null,8250,0.1,825,2.5,8250,0.1,825,2.5,8250,0.1,825,2.5]
[null,8275,0.1,827.5,2.5,8275,0.1,827.5,2.5,8275,0.1,827.5,2.5]
[null,8300,0.1,830,2.5,8300,0.1,830,2.5,8300,0.1,830,2.5]
[null,8325,0.1,832.5,2.5,8325,0.1,832.5,2.5,8325,0.1,832.5,2.5]
[null,8350,0.1,835,2.5,8350,0.1,835,2.5,8350,0.1,835,2.5]
[null,8375,0.1,837.5,2.5,8375,0.1,837.5,2.5,8375,0.1,837.5,2.5]
[null,8400,0.15,{"$f":"+(B345-8375)*C345+837.5","v":841.25},3.75,8400,0.1,840,2.5,8400,0.1,840,2.5]
[null,8425,0.15,845,3.75,8425,0.1,842.5,2.5,8425,0.1,842.5,2.5]
[null,8450,0.15,848.75,3.75,8450,0.1,845,2.5,8450,0.1,845,2.5]
[null,8475,0.15,852.5,3.75,8475,0.1,847.5,2.5,8475,0.1,847.5,2.5]
[null,8500,0.15,856.25,3.75,8500,0.1,850,2.5,8500,0.1,850,2.5]
[null,8525,0.15,860,3.75,8525,0.1,852.5,2.5,8525,0.1,852.5,2.5]
[null,8550,0.15,863.75,3.75,8550,0.1,855,2.5,8550,0.1,855,2.5]
[null,8575,0.15,867.5,3.75,8575,0.1,857.5,2.5,8575,0.1,857.5,2.5]
[null,8600,0.15,871.25,3.75,8600,0.1,860,2.5,8600,0.1,860,2.5]
[null,8625,0.15,875,3.75,8625,0.1,862.5,2.5,8625,0.1,862.5,2.5]
[null,8650,0.15,878.75,3.75,8650,0.1,865,2.5,8650,0.1,865,2.5]
[null,8675,0.15,882.5,3.75,8675,0.1,867.5,2.5,8675,0.1,867.5,2.5]
[null,8700,0.15,886.25,3.75,8700,0.1,870,2.5,8700,0.1,870,2.5]
[null,8725,0.15,890,3.75,8725,0.1,872.5,2.5,8725,0.1,872.5,2.5]
[null,8750,0.15,893.75,3.75,8750,0.1,875,2.5,8750,0.1,875,2.5]
[null,8775,0.15,897.5,3.75,8775,0.1,877.5,2.5,8775,0.1,877.5,2.5]
[null,8800,0.15,901.25,3.75,8800,0.1,880,2.5,8800,0.1,880,2.5]
[null,8825,0.15,905,3.75,8825,0.1,882.5,2.5,8825,0.1,882.5,2.5]
[null,8850,0.15,908.75,3.75,8850,0.1,885,2.5,8850,0.1,885,2.5]
[null,8875,0.15,912.5,3.75,8875,0.1,887.5,2.5,8875,0.1,887.5,2.5]
[null,8900,0.15,916.25,3.75,8900,0.1,890,2.5,8900,0.1,890,2.5]
[null,8925,0.15,920,3.75,8925,0.1,892.5,2.5,8925,0.1,892.5,2.5]
[null,8950,0.15,923.75,3.75,8950,0.1,895,2.5,8950,0.1,895,2.5]
[null,8975,0.15,927.5,3.75,8975,0.1,897.5,2.5,8975,0.1,897.5,2.5]
[null,9000,0.15,931.25,3.75,9000,0.1,900,2.5,9000,0.1,900,2.5]
[null,9025,0.15,935,3.75,9025,0.1,902.5,2.5,9025,0.1,902.5,2.5]
[null,9050,0.15,938.75,3.75,9050,0.1,905,2.5,9050,0.1,905,2.5]
[null,9075,0.15,942.5,3.75,9075,0.1,907.5,2.5,9075,0.1,907.5,2.5]
[null,9100,0.15,946.25,{"$f":"+D373-D372","v":3.75},9100,0.1,910,2.5,9100,0.1,910,2.5]
[null,9125,0.15,950,3.75,9125,0.1,912.5,2.5,9125,0.1,912.5,2.5]
[null,9150,0.15,953.75,3.75,9150,0.1,915,2.5,9150,0.1,915,2.5]
[null,9175,0.15,957.5,3.75,9175,0.1,917.5,2.5,9175,0.1,917.5,2.5]
[null,9200,0.15,961.25,3.75,9200,0.1,920,2.5,9200,0.1,920,2.5]
[null,9225,0.15,965,3.75,9225,0.1,922.5,2.5,9225,0.1,922.5,2.5]
[null,9250,0.15,968.75,3.75,9250,0.1,925,2.5,9250,0.1,925,2.5]
[null,9275,0.15,972.5,3.75,9275,0.1,927.5,2.5,9275,0.1,927.5,2.5]
[null,9300,0.15,976.25,3.75,9300,0.1,930,2.5,9300,0.1,930,2.5]
[null,9325,0.15,980,3.75,9325,0.1,932.5,2.5,9325,0.1,932.5,2.5]
[null,9350,0.15,983.75,3.75,9350,0.1,935,2.5,9350,0.1,935,2.5]
[null,9375,0.15,987.5,3.75,9375,0.1,937.5,2.5,9375,0.1,937.5,2.5]
[null,9400,0.15,991.25,3.75,9400,0.1,940,2.5,9400,0.1,940,2.5]
[null,9425,0.15,995,3.75,9425,0.1,942.5,2.5,9425,0.1,942.5,2.5]
[null,9450,0.15,998.75,3.75,9450,0.1,945,2.5,9450,0.1,945,2.5]
[null,9475,0.15,1002.5,3.75,9475,0.1,947.5,2.5,9475,0.1,947.5,2.5]
[null,9500,0.15,1006.25,3.75,9500,0.1,950,2.5,9500,0.1,950,2.5]
[null,9525,0.15,1010,3.75,9525,0.1,952.5,2.5,9525,0.1,952.5,2.5]
[null,9550,0.15,1013.75,3.75,9550,0.1,955,2.5,9550,0.1,955,2.5]
[null,9575,0.15,1017.5,3.75,9575,0.1,957.5,2.5,9575,0.1,957.5,2.5]
[null,9600,0.15,1021.25,3.75,9600,0.1,960,2.5,9600,0.1,960,2.5]
[null,9625,0.15,1025,3.75,9625,0.1,{"$f":"+F394*G394","v":962.5},{"$f":"+H394-H393","v":2.5},9625,0.1,{"$f":"+J394*K394","v":962.5},{"$f":"+L394-L393","v":2.5}]
[null,9650,0.15,1028.75,3.75,9650,0.1,965,2.5,9650,0.1,965,2.5]
[null,9675,0.15,1032.5,3.75,9675,0.1,967.5,2.5,9675,0.1,967.5,2.5]
[null,9700,0.15,1036.25,3.75,9700,0.1,970,2.5,9700,0.1,970,2.5]
[null,9725,0.15,1040,3.75,9725,0.1,972.5,2.5,9725,0.1,972.5,2.5]
[null,9750,0.15,1043.75,3.75,9750,0.1,975,2.5,9750,0.1,975,2.5]
[null,9775,0.15,1047.5,3.75,9775,0.1,977.5,2.5,9775,0.1,977.5,2.5]
[null,9800,0.15,1051.25,3.75,9800,0.1,980,2.5,9800,0.1,980,2.5]
[null,9825,0.15,1055,3.75,9825,0.1,982.5,2.5,9825,0.1,982.5,2.5]
[null,9850,0.15,1058.75,3.75,9850,0.1,985,2.5,9850,0.1,985,2.5]
[null,9875,0.15,1062.5,3.75,9875,0.1,987.5,2.5,9875,0.1,987.5,2.5]
[null,9900,0.15,1066.25,3.75,9900,0.1,990,2.5,9900,0.1,990,2.5]
[null,9925,0.15,1070,3.75,9925,0.1,992.5,2.5,9925,0.1,992.5,2.5]
[null,9950,0.15,1073.75,3.75,9950,0.1,995,2.5,9950,0.1,995,2.5]
[null,9975,0.15,1077.5,3.75,9975,0.1,997.5,2.5,9975,0.1,997.5,2.5]
[null,10000,0.15,{"$f":"+(B409-8375)*C409+837.5","v":1081.25},3.75,10000,0.1,1000,2.5,10000,0.1,1000,2.5]
[null,10025,0.15,1085,3.75,10025,0.1,1002.5,2.5,10025,0.1,1002.5,2.5]
[null,10050,0.15,1088.75,3.75,10050,0.1,1005,2.5,10050,0.1,1005,2.5]
[null,10075,0.15,1092.5,3.75,10075,0.1,1007.5,2.5,10075,0.1,1007.5,2.5]
[null,10100,0.15,1096.25,3.75,10100,0.1,1010,2.5,10100,0.1,1010,2.5]
[null,10125,0.15,1100,3.75,10125,0.1,1012.5,2.5,10125,0.1,1012.5,2.5]
[null,10150,0.15,1103.75,3.75,10150,0.1,1015,2.5,10150,0.1,1015,2.5]
[null,10175,0.15,1107.5,3.75,10175,0.1,1017.5,2.5,10175,0.1,1017.5,2.5]
[null,10200,0.15,1111.25,3.75,10200,0.1,1020,2.5,10200,0.1,1020,2.5]
[null,10225,0.15,1115,3.75,10225,0.1,1022.5,2.5,10225,0.1,1022.5,2.5]
[null,10250,0.15,1118.75,3.75,10250,0.1,1025,2.5,10250,0.1,1025,2.5]
[null,10275,0.15,1122.5,3.75,10275,0.1,1027.5,2.5,10275,0.1,1027.5,2.5]
[null,10300,0.15,1126.25,3.75,10300,0.1,1030,2.5,10300,0.1,1030,2.5]
[null,10325,0.15,1130,3.75,10325,0.1,1032.5,2.5,10325,0.1,1032.5,2.5]
[null,10350,0.15,1133.75,3.75,10350,0.1,1035,2.5,10350,0.1,1035,2.5]
[null,10375,0.15,1137.5,3.75,10375,0.1,1037.5,2.5,10375,0.1,1037.5,2.5]
[null,10400,0.15,1141.25,3.75,10400,0.1,1040,2.5,10400,0.1,1040,2.5]
[null,10425,0.15,1145,3.75,10425,0.1,1042.5,2.5,10425,0.1,1042.5,2.5]
[null,10450,0.15,1148.75,3.75,10450,0.1,1045,2.5,10450,0.1,1045,2.5]
[null,10475,0.15,1152.5,3.75,10475,0.1,1047.5,2.5,10475,0.1,1047.5,2.5]
[null,10500,0.15,1156.25,3.75,10500,0.1,1050,2.5,10500,0.1,1050,2.5]
[null,10525,0.15,1160,3.75,10525,0.1,1052.5,2.5,10525,0.1,1052.5,2.5]
[null,10550,0.15,1163.75,3.75,10550,0.1,1055,2.5,10550,0.1,1055,2.5]
[null,10575,0.15,1167.5,3.75,10575,0.1,1057.5,2.5,10575,0.1,1057.5,2.5]
[null,10600,0.15,1171.25,3.75,10600,0.1,1060,2.5,10600,0.1,1060,2.5]
[null,10625,0.15,1175,3.75,10625,0.1,1062.5,2.5,10625,0.1,1062.5,2.5]
[null,10650,0.15,1178.75,3.75,10650,0.1,1065,2.5,10650,0.1,1065,2.5]
[null,10675,0.15,1182.5,3.75,10675,0.1,1067.5,2.5,10675,0.1,1067.5,2.5]
[null,10700,0.15,1186.25,{"$f":"+D437-D436","v":3.75},10700,0.1,1070,2.5,10700,0.1,1070,2.5]
[null,10725,0.15,1190,3.75,10725,0.1,1072.5,2.5,10725,0.1,1072.5,2.5]
[null,10750,0.15,1193.75,3.75,10750,0.1,1075,2.5,10750,0.1,1075,2.5]
[null,10775,0.15,1197.5,3.75,10775,0.1,1077.5,2.5,10775,0.1,1077.5,2.5]
[null,10800,0.15,1201.25,3.75,10800,0.1,1080,2.5,10800,0.1,1080,2.5]
[null,10825,0.15,1205,3.75,10825,0.1,1082.5,2.5,10825,0.1,1082.5,2.5]
[null,10850,0.15,1208.75,3.75,10850,0.1,1085,2.5,10850,0.1,1085,2.5]
[null,10875,0.15,1212.5,3.75,10875,0.1,1087.5,2.5,10875,0.1,1087.5,2.5]
[null,10900,0.15,1216.25,3.75,10900,0.1,1090,2.5,10900,0.1,1090,2.5]
[null,10925,0.15,1220,3.75,10925,0.1,1092.5,2.5,10925,0.1,1092.5,2.5]
[null,10950,0.15,1223.75,3.75,10950,0.1,1095,2.5,10950,0.1,1095,2.5]
[null,10975,0.15,1227.5,3.75,10975,0.1,1097.5,2.5,10975,0.1,1097.5,2.5]
[null,11000,0.15,1231.25,3.75,11000,0.1,1100,2.5,11000,0.1,1100,2.5]
[null,11025,0.15,1235,3.75,11025,0.1,1102.5,2.5,11025,0.1,1102.5,2.5]
[null,11050,0.15,1238.75,3.75,11050,0.1,1105,2.5,11050,0.1,1105,2.5]
[null,11075,0.15,1242.5,3.75,11075,0.1,1107.5,2.5,11075,0.1,1107.5,2.5]
[null,11100,0.15,1246.25,3.75,11100,0.1,1110,2.5,11100,0.1,1110,2.5]
[null,11125,0.15,1250,3.75,11125,0.1,1112.5,2.5,11125,0.1,1112.5,2.5]
[null,11150,0.15,1253.75,3.75,11150,0.1,1115,2.5,11150,0.1,1115,2.5]
[null,11175,0.15,1257.5,3.75,11175,0.1,1117.5,2.5,11175,0.1,1117.5,2.5]
[null,11200,0.15,1261.25,3.75,11200,0.1,1120,2.5,11200,0.1,1120,2.5]
[null,11225,0.15,1265,3.75,11225,0.1,{"$f":"+F458*G458","v":1122.5},{"$f":"+H458-H457","v":2.5},11225,0.1,{"$f":"+J458*K458","v":1122.5},{"$f":"+L458-L457","v":2.5}]
[null,11250,0.15,1268.75,3.75,11250,0.1,1125,2.5,11250,0.1,1125,2.5]
[null,11275,0.15,1272.5,3.75,11275,0.1,1127.5,2.5,11275,0.1,1127.5,2.5]
[null,11300,0.15,1276.25,3.75,11300,0.1,1130,2.5,11300,0.1,1130,2.5]
[null,11325,0.15,1280,3.75,11325,0.1,1132.5,2.5,11325,0.1,1132.5,2.5]
[null,11350,0.15,1283.75,3.75,11350,0.1,1135,2.5,11350,0.1,1135,2.5]
[null,11375,0.15,1287.5,3.75,11375,0.1,1137.5,2.5,11375,0.1,1137.5,2.5]
[null,11400,0.15,1291.25,3.75,11400,0.1,1140,2.5,11400,0.1,1140,2.5]
[null,11425,0.15,1295,3.75,11425,0.1,1142.5,2.5,11425,0.1,1142.5,2.5]
[null,11450,0.15,1298.75,3.75,11450,0.1,1145,2.5,11450,0.1,1145,2.5]
[null,11475,0.15,1302.5,3.75,11475,0.1,1147.5,2.5,11475,0.1,1147.5,2.5]
[null,11500,0.15,1306.25,3.75,11500,0.1,1150,2.5,11500,0.1,1150,2.5]
[null,11525,0.15,1310,3.75,11525,0.1,1152.5,2.5,11525,0.1,1152.5,2.5]
[null,11550,0.15,1313.75,3.75,11550,0.1,1155,2.5,11550,0.1,1155,2.5]
[null,11575,0.15,1317.5,3.75,11575,0.1,1157.5,2.5,11575,0.1,1157.5,2.5]
[null,11600,0.15,{"$f":"+(B473-8375)*C473+837.5","v":1321.25},3.75,11600,0.1,1160,2.5,11600,0.1,1160,2.5]
[null,11625,0.15,1325,3.75,11625,0.1,1162.5,2.5,11625,0.1,1162.5,2.5]
[null,11650,0.15,1328.75,3.75,11650,0.1,1165,2.5,11650,0.1,1165,2.5]
[null,11675,0.15,1332.5,3.75,11675,0.1,1167.5,2.5,11675,0.1,1167.5,2.5]
[null,11700,0.15,1336.25,3.75,11700,0.1,1170,2.5,11700,0.1,1170,2.5]
[null,11725,0.15,1340,3.75,11725,0.1,1172.5,2.5,11725,0.1,1172.5,2.5]
[null,11750,0.15,1343.75,3.75,11750,0.1,1175,2.5,11750,0.1,1175,2.5]
[null,11775,0.15,1347.5,3.75,11775,0.1,1177.5,2.5,11775,0.1,1177.5,2.5]
[null,11800,0.15,1351.25,3.75,11800,0.1,1180,2.5,11800,0.1,1180,2.5]
[null,11825,0.15,1355,3.75,11825,0.1,1182.5,2.5,11825,0.1,1182.5,2.5]
[null,11850,0.15,1358.75,3.75,11850,0.1,1185,2.5,11850,0.1,1185,2.5]
[null,11875,0.15,1362.5,3.75,11875,0.1,1187.5,2.5,11875,0.1,1187.5,2.5]
[null,11900,0.15,1366.25,3.75,11900,0.1,1190,2.5,11900,0.1,1190,2.5]
[null,11925,0.15,1370,3.75,11925,0.1,1192.5,2.5,11925,0.1,1192.5,2.5]
[null,11950,0.15,1373.75,3.75,11950,0.1,1195,2.5,11950,0.1,1195,2.5]
[null,11975,0.15,1377.5,3.75,11975,0.1,1197.5,2.5,11975,0.15,{"$f":"+(J488-11950)*K488+$L$487","v":1198.75},3.75]
[null,12000,0.15,1381.25,3.75,12000,0.1,1200,2.5,12000,0.15,1202.5,3.75]
[null,12025,0.15,1385,3.75,12025,0.1,1202.5,2.5,12025,0.15,1206.25,3.75]
[null,12050,0.15,1388.75,3.75,12050,0.1,1205,2.5,12050,0.15,1210,3.75]
[null,12075,0.15,1392.5,3.75,12075,0.1,1207.5,2.5,12075,0.15,1213.75,3.75]
[null,12100,0.15,1396.25,3.75,12100,0.1,1210,2.5,12100,0.15,1217.5,3.75]
[null,12125,0.15,1400,3.75,12125,0.1,1212.5,2.5,12125,0.15,1221.25,3.75]
[null,12150,0.15,1403.75,3.75,12150,0.1,1215,2.5,12150,0.15,1225,3.75]
[null,12175,0.15,1407.5,3.75,12175,0.1,1217.5,2.5,12175,0.15,1228.75,3.75]
[null,12200,0.15,1411.25,3.75,12200,0.1,1220,2.5,12200,0.15,1232.5,3.75]
[null,12225,0.15,1415,3.75,12225,0.1,1222.5,2.5,12225,0.15,1236.25,3.75]
[null,12250,0.15,1418.75,3.75,12250,0.1,1225,2.5,12250,0.15,1240,3.75]
[null,12275,0.15,1422.5,3.75,12275,0.1,1227.5,2.5,12275,0.15,1243.75,3.75]
[null,12300,0.15,1426.25,{"$f":"+D501-D500","v":3.75},12300,0.1,1230,2.5,12300,0.15,1247.5,3.75]
[null,12325,0.15,1430,3.75,12325,0.1,1232.5,2.5,12325,0.15,1251.25,3.75]
[null,12350,0.15,1433.75,3.75,12350,0.1,1235,2.5,12350,0.15,1255,3.75]
[null,12375,0.15,1437.5,3.75,12375,0.1,1237.5,2.5,12375,0.15,1258.75,3.75]
[null,12400,0.15,1441.25,3.75,12400,0.1,1240,2.5,12400,0.15,1262.5,3.75]
[null,12425,0.15,1445,3.75,12425,0.1,1242.5,2.5,12425,0.15,1266.25,3.75]
[null,12450,0.15,1448.75,3.75,12450,0.1,1245,2.5,12450,0.15,1270,3.75]
[null,12475,0.15,1452.5,3.75,12475,0.1,1247.5,2.5,12475,0.15,1273.75,3.75]
[null,12500,0.15,1456.25,3.75,12500,0.1,1250,2.5,12500,0.15,1277.5,3.75]
[null,12525,0.15,1460,3.75,12525,0.1,1252.5,2.5,12525,0.15,1281.25,3.75]
[null,12550,0.15,1463.75,3.75,12550,0.1,1255,2.5,12550,0.15,1285,3.75]
[null,12575,0.15,1467.5,3.75,12575,0.1,1257.5,2.5,12575,0.15,1288.75,3.75]
[null,12600,0.15,1471.25,3.75,12600,0.1,1260,2.5,12600,0.15,1292.5,3.75]
[null,12625,0.15,1475,3.75,12625,0.1,1262.5,2.5,12625,0.15,1296.25,3.75]
[null,12650,0.15,1478.75,3.75,12650,0.1,1265,2.5,12650,0.15,1300,3.75]
[null,12675,0.15,1482.5,3.75,12675,0.1,1267.5,2.5,12675,0.15,1303.75,3.75]
[null,12700,0.15,1486.25,3.75,12700,0.1,1270,2.5,12700,0.15,1307.5,3.75]
[null,12725,0.15,1490,3.75,12725,0.1,1272.5,2.5,12725,0.15,1311.25,3.75]
[null,12750,0.15,1493.75,3.75,12750,0.1,1275,2.5,12750,0.15,1315,3.75]
[null,12775,0.15,1497.5,3.75,12775,0.1,1277.5,2.5,12775,0.15,1318.75,3.75]
[null,12800,0.15,1501.25,3.75,12800,0.1,1280,2.5,12800,0.15,1322.5,3.75]
[null,12825,0.15,1505,3.75,12825,0.1,{"$f":"+F522*G522","v":1282.5},{"$f":"+H522-H521","v":2.5},12825,0.15,1326.25,{"$f":"+L522-L521","v":3.75}]
[null,12850,0.15,1508.75,3.75,12850,0.1,1285,2.5,12850,0.15,1330,3.75]
[null,12875,0.15,1512.5,3.75,12875,0.1,1287.5,2.5,12875,0.15,1333.75,3.75]
[null,12900,0.15,1516.25,3.75,12900,0.1,1290,2.5,12900,0.15,1337.5,3.75]
[null,12925,0.15,1520,3.75,12925,0.1,1292.5,2.5,12925,0.15,1341.25,3.75]
[null,12950,0.15,1523.75,3.75,12950,0.1,1295,2.5,12950,0.15,1345,3.75]
[null,12975,0.15,1527.5,3.75,12975,0.1,1297.5,2.5,12975,0.15,1348.75,3.75]
[null,13000,0.15,1531.25,3.75,13000,0.1,1300,2.5,13000,0.15,1352.5,3.75]
[null,13025,0.15,1535,3.75,13025,0.1,1302.5,2.5,13025,0.15,1356.25,3.75]
[null,13050,0.15,1538.75,3.75,13050,0.1,1305,2.5,13050,0.15,1360,3.75]
[null,13075,0.15,1542.5,3.75,13075,0.1,1307.5,2.5,13075,0.15,1363.75,3.75]
[null,13100,0.15,1546.25,3.75,13100,0.1,1310,2.5,13100,0.15,1367.5,3.75]
[null,13125,0.15,1550,3.75,13125,0.1,1312.5,2.5,13125,0.15,1371.25,3.75]
[null,13150,0.15,1553.75,3.75,13150,0.1,1315,2.5,13150,0.15,1375,3.75]
[null,13175,0.15,1557.5,3.75,13175,0.1,1317.5,2.5,13175,0.15,1378.75,3.75]
[null,13200,0.15,{"$f":"+(B537-8375)*C537+837.5","v":1561.25},3.75,13200,0.1,1320,2.5,13200,0.15,1382.5,3.75]
[null,13225,0.15,1565,3.75,13225,0.1,1322.5,2.5,13225,0.15,1386.25,3.75]
[null,13250,0.15,1568.75,3.75,13250,0.1,1325,2.5,13250,0.15,1390,3.75]
[null,13275,0.15,1572.5,3.75,13275,0.1,1327.5,2.5,13275,0.15,1393.75,3.75]
[null,13300,0.15,1576.25,3.75,13300,0.1,1330,2.5,13300,0.15,1397.5,3.75]
[null,13325,0.15,1580,3.75,13325,0.1,1332.5,2.5,13325,0.15,1401.25,3.75]
[null,13350,0.15,1583.75,3.75,13350,0.1,1335,2.5,13350,0.15,1405,3.75]
[null,13375,0.15,1587.5,3.75,13375,0.1,1337.5,2.5,13375,0.15,1408.75,3.75]
[null,13400,0.15,1591.25,3.75,13400,0.1,1340,2.5,13400,0.15,1412.5,3.75]
[null,13425,0.15,1595,3.75,13425,0.1,1342.5,2.5,13425,0.15,1416.25,3.75]
[null,13450,0.15,1598.75,3.75,13450,0.1,1345,2.5,13450,0.15,1420,3.75]
[null,13475,0.15,1602.5,3.75,13475,0.1,1347.5,2.5,13475,0.15,1423.75,3.75]
[null,13500,0.15,1606.25,3.75,13500,0.1,1350,2.5,13500,0.15,1427.5,3.75]
[null,13525,0.15,1610,3.75,13525,0.1,1352.5,2.5,13525,0.15,1431.25,3.75]
[null,13550,0.15,1613.75,3.75,13550,0.1,1355,2.5,13550,0.15,1435,3.75]
[null,13575,0.15,1617.5,3.75,13575,0.1,1357.5,2.5,13575,0.15,{"$f":"+(J552-11950)*K552+$L$487","v":1438.75},3.75]
[null,13600,0.15,1621.25,3.75,13600,0.1,1360,2.5,13600,0.15,1442.5,3.75]
[null,13625,0.15,1625,3.75,13625,0.1,1362.5,2.5,13625,0.15,1446.25,3.75]
[null,13650,0.15,1628.75,3.75,13650,0.1,1365,2.5,13650,0.15,1450,3.75]
[null,13675,0.15,1632.5,3.75,13675,0.1,1367.5,2.5,13675,0.15,1453.75,3.75]
[null,13700,0.15,1636.25,3.75,13700,0.1,1370,2.5,13700,0.15,1457.5,3.75]
[null,13725,0.15,1640,3.75,13725,0.1,1372.5,2.5,13725,0.15,1461.25,3.75]
[null,13750,0.15,1643.75,3.75,13750,0.1,1375,2.5,13750,0.15,1465,3.75]
[null,13775,0.15,1647.5,3.75,13775,0.1,1377.5,2.5,13775,0.15,1468.75,3.75]
[null,13800,0.15,1651.25,3.75,13800,0.1,1380,2.5,13800,0.15,1472.5,3.75]
[null,13825,0.15,1655,3.75,13825,0.1,1382.5,2.5,13825,0.15,1476.25,3.75]
[null,13850,0.15,1658.75,3.75,13850,0.1,1385,2.5,13850,0.15,1480,3.75]
[null,13875,0.15,1662.5,3.75,13875,0.1,1387.5,2.5,13875,0.15,1483.75,3.75]
[null,13900,0.15,1666.25,{"$f":"+D565-D564","v":3.75},13900,0.1,1390,2.5,13900,0.15,1487.5,3.75]
[null,13925,0.15,1670,3.75,13925,0.1,1392.5,2.5,13925,0.15,1491.25,3.75]
[null,13950,0.15,1673.75,3.75,13950,0.1,1395,2.5,13950,0.15,1495,3.75]
[null,13975,0.15,1677.5,3.75,13975,0.1,1397.5,2.5,13975,0.15,1498.75,3.75]
[null,14000,0.15,1681.25,3.75,14000,0.1,1400,2.5,14000,0.15,1502.5,3.75]
[null,14025,0.15,1685,3.75,14025,0.1,1402.5,2.5,14025,0.15,1506.25,3.75]
[null,14050,0.15,1688.75,3.75,14050,0.1,1405,2.5,14050,0.15,1510,3.75]
[null,14075,0.15,1692.5,3.75,14075,0.1,1407.5,2.5,14075,0.15,1513.75,3.75]
[null,14100,0.15,1696.25,3.75,14100,0.1,1410,2.5,14100,0.15,1517.5,3.75]
[null,14125,0.15,1700,3.75,14125,0.1,1412.5,2.5,14125,0.15,1521.25,3.75]
[null,14150,0.15,1703.75,3.75,14150,0.1,1415,2.5,14150,0.15,1525,3.75]
[null,14175,0.15,1707.5,3.75,14175,0.1,1417.5,2.5,14175,0.15,1528.75,3.75]
[null,14200,0.15,1711.25,3.75,14200,0.1,1420,2.5,14200,0.15,1532.5,3.75]
[null,14225,0.15,1715,3.75,14225,0.1,1422.5,2.5,14225,0.15,1536.25,3.75]
[null,14250,0.15,1718.75,3.75,14250,0.1,1425,2.5,14250,0.15,1540,3.75]
[null,14275,0.15,1722.5,3.75,14275,0.1,1427.5,2.5,14275,0.15,1543.75,3.75]
[null,14300,0.15,1726.25,3.75,14300,0.1,1430,2.5,14300,0.15,1547.5,3.75]
[null,14325,0.15,1730,3.75,14325,0.1,1432.5,2.5,14325,0.15,1551.25,3.75]
[null,14350,0.15,1733.75,3.75,14350,0.1,1435,2.5,14350,0.15,1555,3.75]
[null,14375,0.15,1737.5,3.75,14375,0.1,1437.5,2.5,14375,0.15,1558.75,3.75]
[null,14400,0.15,1741.25,3.75,14400,0.1,1440,2.5,14400,0.15,1562.5,3.75]
[null,14425,0.15,1745,3.75,14425,0.1,{"$f":"+F586*G586","v":1442.5},{"$f":"+H586-H585","v":2.5},14425,0.15,1566.25,{"$f":"+L586-L585","v":3.75}]
[null,14450,0.15,1748.75,3.75,14450,0.1,1445,2.5,14450,0.15,1570,3.75]
[null,14475,0.15,1752.5,3.75,14475,0.1,1447.5,2.5,14475,0.15,1573.75,3.75]
[null,14500,0.15,1756.25,3.75,14500,0.1,1450,2.5,14500,0.15,1577.5,3.75]
[null,14525,0.15,1760,3.75,14525,0.1,1452.5,2.5,14525,0.15,1581.25,3.75]
[null,14550,0.15,1763.75,3.75,14550,0.1,1455,2.5,14550,0.15,1585,3.75]
[null,14575,0.15,1767.5,3.75,14575,0.1,1457.5,2.5,14575,0.15,1588.75,3.75]
[null,14600,0.15,1771.25,3.75,14600,0.1,1460,2.5,14600,0.15,1592.5,3.75]
[null,14625,0.15,1775,3.75,14625,0.1,1462.5,2.5,14625,0.15,1596.25,3.75]
[null,14650,0.15,1778.75,3.75,14650,0.1,1465,2.5,14650,0.15,1600,3.75]
[null,14675,0.15,1782.5,3.75,14675,0.1,1467.5,2.5,14675,0.15,1603.75,3.75]
[null,14700,0.15,1786.25,3.75,14700,0.1,1470,2.5,14700,0.15,1607.5,3.75]
[null,14725,0.15,1790,3.75,14725,0.1,1472.5,2.5,14725,0.15,1611.25,3.75]
[null,14750,0.15,1793.75,3.75,14750,0.1,1475,2.5,14750,0.15,1615,3.75]
[null,14775,0.15,1797.5,3.75,14775,0.1,1477.5,2.5,14775,0.15,1618.75,3.75]
[null,14800,0.15,{"$f":"+(B601-8375)*C601+837.5","v":1801.25},3.75,14800,0.1,1480,2.5,14800,0.15,1622.5,3.75]
[null,14825,0.15,1805,3.75,14825,0.1,1482.5,2.5,14825,0.15,1626.25,3.75]
[null,14850,0.15,1808.75,3.75,14850,0.1,1485,2.5,14850,0.15,1630,3.75]
[null,14875,0.15,1812.5,3.75,14875,0.1,1487.5,2.5,14875,0.15,1633.75,3.75]
[null,14900,0.15,1816.25,3.75,14900,0.1,1490,2.5,14900,0.15,1637.5,3.75]
[null,14925,0.15,1820,3.75,14925,0.1,1492.5,2.5,14925,0.15,1641.25,3.75]
[null,14950,0.15,1823.75,3.75,14950,0.1,1495,2.5,14950,0.15,1645,3.75]
[null,14975,0.15,1827.5,3.75,14975,0.1,1497.5,2.5,14975,0.15,1648.75,3.75]
[null,15000,0.15,1831.25,3.75,15000,0.1,1500,2.5,15000,0.15,1652.5,3.75]
[null,15025,0.15,1835,3.75,15025,0.1,1502.5,2.5,15025,0.15,1656.25,3.75]
[null,15050,0.15,1838.75,3.75,15050,0.1,1505,2.5,15050,0.15,1660,3.75]
[null,15075,0.15,1842.5,3.75,15075,0.1,1507.5,2.5,15075,0.15,1663.75,3.75]
[null,15100,0.15,1846.25,3.75,15100,0.1,1510,2.5,15100,0.15,1667.5,3.75]
[null,15125,0.15,1850,3.75,15125,0.1,1512.5,2.5,15125,0.15,1671.25,3.75]
[null,15150,0.15,1853.75,3.75,15150,0.1,1515,2.5,15150,0.15,1675,3.75]
[null,15175,0.15,1857.5,3.75,15175,0.1,1517.5,2.5,15175,0.15,{"$f":"+(J616-11950)*K616+$L$487","v":1678.75},3.75]
[null,15200,0.15,1861.25,3.75,15200,0.1,1520,2.5,15200,0.15,1682.5,3.75]
[null,15225,0.15,1865,3.75,15225,0.1,1522.5,2.5,15225,0.15,1686.25,3.75]
[null,15250,0.15,1868.75,3.75,15250,0.1,1525,2.5,15250,0.15,1690,3.75]
[null,15275,0.15,1872.5,3.75,15275,0.1,1527.5,2.5,15275,0.15,1693.75,3.75]
[null,15300,0.15,1876.25,3.75,15300,0.1,1530,2.5,15300,0.15,1697.5,3.75]
[null,15325,0.15,1880,3.75,15325,0.1,1532.5,2.5,15325,0.15,1701.25,3.75]
[null,15350,0.15,1883.75,3.75,15350,0.1,1535,2.5,15350,0.15,1705,3.75]
[null,15375,0.15,1887.5,3.75,15375,0.1,1537.5,2.5,15375,0.15,1708.75,3.75]
[null,15400,0.15,1891.25,3.75,15400,0.1,1540,2.5,15400,0.15,1712.5,3.75]
[null,15425,0.15,1895,3.75,15425,0.1,1542.5,2.5,15425,0.15,1716.25,3.75]
[null,15450,0.15,1898.75,3.75,15450,0.1,1545,2.5,15450,0.15,1720,3.75]
[null,15475,0.15,1902.5,3.75,15475,0.1,1547.5,2.5,15475,0.15,1723.75,3.75]
[null,15500,0.15,1906.25,{"$f":"+D629-D628","v":3.75},15500,0.1,1550,2.5,15500,0.15,1727.5,3.75]
[null,15525,0.15,1910,3.75,15525,0.1,1552.5,2.5,15525,0.15,1731.25,3.75]
[null,15550,0.15,1913.75,3.75,15550,0.1,1555,2.5,15550,0.15,1735,3.75]
[null,15575,0.15,1917.5,3.75,15575,0.1,1557.5,2.5,15575,0.15,1738.75,3.75]
[null,15600,0.15,1921.25,3.75,15600,0.1,1560,2.5,15600,0.15,1742.5,3.75]
[null,15625,0.15,1925,3.75,15625,0.1,1562.5,2.5,15625,0.15,1746.25,3.75]
[null,15650,0.15,1928.75,3.75,15650,0.1,1565,2.5,15650,0.15,1750,3.75]
[null,15675,0.15,1932.5,3.75,15675,0.1,1567.5,2.5,15675,0.15,1753.75,3.75]
[null,15700,0.15,1936.25,3.75,15700,0.1,1570,2.5,15700,0.15,1757.5,3.75]
[null,15725,0.15,1940,3.75,15725,0.1,1572.5,2.5,15725,0.15,1761.25,3.75]
[null,15750,0.15,1943.75,3.75,15750,0.1,1575,2.5,15750,0.15,1765,3.75]
[null,15775,0.15,1947.5,3.75,15775,0.1,1577.5,2.5,15775,0.15,1768.75,3.75]
[null,15800,0.15,1951.25,3.75,15800,0.1,1580,2.5,15800,0.15,1772.5,3.75]
[null,15825,0.15,1955,3.75,15825,0.1,1582.5,2.5,15825,0.15,1776.25,3.75]
[null,15850,0.15,1958.75,3.75,15850,0.1,1585,2.5,15850,0.15,1780,3.75]
[null,15875,0.15,1962.5,3.75,15875,0.1,1587.5,2.5,15875,0.15,1783.75,3.75]
[null,15900,0.15,1966.25,3.75,15900,0.1,1590,2.5,15900,0.15,1787.5,3.75]
[null,15925,0.15,1970,3.75,15925,0.1,1592.5,2.5,15925,0.15,1791.25,3.75]
[null,15950,0.15,1973.75,3.75,15950,0.1,1595,2.5,15950,0.15,1795,3.75]
[null,15975,0.15,1977.5,3.75,15975,0.1,1597.5,2.5,15975,0.15,1798.75,3.75]
[null,16000,0.15,1981.25,3.75,16000,0.1,1600,2.5,16000,0.15,1802.5,3.75]
[null,16025,0.15,1985,3.75,16025,0.1,{"$f":"+F650*G650","v":1602.5},{"$f":"+H650-H649","v":2.5},16025,0.15,1806.25,{"$f":"+L650-L649","v":3.75}]
[null,16050,0.15,1988.75,3.75,16050,0.1,1605,2.5,16050,0.15,1810,3.75]
[null,16075,0.15,1992.5,3.75,16075,0.1,1607.5,2.5,16075,0.15,1813.75,3.75]
[null,16100,0.15,1996.25,3.75,16100,0.1,1610,2.5,16100,0.15,1817.5,3.75]
[null,16125,0.15,2000,3.75,16125,0.1,1612.5,2.5,16125,0.15,1821.25,3.75]
[null,16150,0.15,2003.75,3.75,16150,0.1,1615,2.5,16150,0.15,1825,3.75]
[null,16175,0.15,2007.5,3.75,16175,0.1,1617.5,2.5,16175,0.15,1828.75,3.75]
[null,16200,0.15,2011.25,3.75,16200,0.1,1620,2.5,16200,0.15,1832.5,3.75]
[null,16225,0.15,2015,3.75,16225,0.1,1622.5,2.5,16225,0.15,1836.25,3.75]
[null,16250,0.15,2018.75,3.75,16250,0.1,1625,2.5,16250,0.15,1840,3.75]
[null,16275,0.15,2022.5,3.75,16275,0.1,1627.5,2.5,16275,0.15,1843.75,3.75]
[null,16300,0.15,2026.25,3.75,16300,0.1,1630,2.5,16300,0.15,1847.5,3.75]
[null,16325,0.15,2030,3.75,16325,0.1,1632.5,2.5,16325,0.15,1851.25,3.75]
[null,16350,0.15,2033.75,3.75,16350,0.1,1635,2.5,16350,0.15,1855,3.75]
[null,16375,0.15,2037.5,3.75,16375,0.1,1637.5,2.5,16375,0.15,1858.75,3.75]
[null,16400,0.15,{"$f":"+(B665-8375)*C665+837.5","v":2041.25},3.75,16400,0.1,1640,2.5,16400,0.15,1862.5,3.75]
[null,16425,0.15,2045,3.75,16425,0.1,1642.5,2.5,16425,0.15,1866.25,3.75]
[null,16450,0.15,2048.75,3.75,16450,0.1,1645,2.5,16450,0.15,1870,3.75]
[null,16475,0.15,2052.5,3.75,16475,0.1,1647.5,2.5,16475,0.15,1873.75,3.75]
[null,16500,0.15,2056.25,3.75,16500,0.1,1650,2.5,16500,0.15,1877.5,3.75]
[null,16525,0.15,2060,3.75,16525,0.1,1652.5,2.5,16525,0.15,1881.25,3.75]
[null,16550,0.15,2063.75,3.75,16550,0.1,1655,2.5,16550,0.15,1885,3.75]
[null,16575,0.15,2067.5,3.75,16575,0.1,1657.5,2.5,16575,0.15,1888.75,3.75]
[null,16600,0.15,2071.25,3.75,16600,0.1,1660,2.5,16600,0.15,1892.5,3.75]
[null,16625,0.15,2075,3.75,16625,0.1,1662.5,2.5,16625,0.15,1896.25,3.75]
[null,16650,0.15,2078.75,3.75,16650,0.1,1665,2.5,16650,0.15,1900,3.75]
[null,16675,0.15,2082.5,3.75,16675,0.1,1667.5,2.5,16675,0.15,1903.75,3.75]
[null,16700,0.15,2086.25,3.75,16700,0.1,1670,2.5,16700,0.15,1907.5,3.75]
[null,16725,0.15,2090,3.75,16725,0.1,1672.5,2.5,16725,0.15,1911.25,3.75]
[null,16750,0.15,2093.75,3.75,16750,0.1,1675,2.5,16750,0.15,1915,3.75]
[null,16775,0.15,2097.5,3.75,16775,0.15,{"$f":"+(F680-16750)*G680+$H$679","v":1678.75},3.75,16775,0.15,{"$f":"+(J680-11950)*K680+$L$487","v":1918.75},3.75]
[null,16800,0.15,2101.25,3.75,16800,0.15,1682.5,3.75,16800,0.15,1922.5,3.75]
[null,16825,0.15,2105,3.75,16825,0.15,1686.25,3.75,16825,0.15,1926.25,3.75]
[null,16850,0.15,2108.75,3.75,16850,0.15,1690,3.75,16850,0.15,1930,3.75]
[null,16875,0.15,2112.5,3.75,16875,0.15,1693.75,3.75,16875,0.15,1933.75,3.75]
[null,16900,0.15,2116.25,3.75,16900,0.15,1697.5,3.75,16900,0.15,1937.5,3.75]
[null,16925,0.15,2120,3.75,16925,0.15,1701.25,3.75,16925,0.15,1941.25,3.75]
[null,16950,0.15,2123.75,3.75,16950,0.15,1705,3.75,16950,0.15,1945,3.75]
[null,16975,0.15,2127.5,3.75,16975,0.15,1708.75,3.75,16975,0.15,1948.75,3.75]
[null,17000,0.15,2131.25,3.75,17000,0.15,1712.5,3.75,17000,0.15,1952.5,3.75]
[null,17025,0.15,2135,3.75,17025,0.15,1716.25,3.75,17025,0.15,1956.25,3.75]
[null,17050,0.15,2138.75,3.75,17050,0.15,1720,3.75,17050,0.15,1960,3.75]
[null,17075,0.15,2142.5,3.75,17075,0.15,1723.75,3.75,17075,0.15,1963.75,3.75]
[null,17100,0.15,2146.25,{"$f":"+D693-D692","v":3.75},17100,0.15,1727.5,3.75,17100,0.15,1967.5,3.75]
[null,17125,0.15,2150,3.75,17125,0.15,1731.25,3.75,17125,0.15,1971.25,3.75]
[null,17150,0.15,2153.75,3.75,17150,0.15,1735,3.75,17150,0.15,1975,3.75]
[null,17175,0.15,2157.5,3.75,17175,0.15,1738.75,3.75,17175,0.15,1978.75,3.75]
[null,17200,0.15,2161.25,3.75,17200,0.15,1742.5,3.75,17200,0.15,1982.5,3.75]
[null,17225,0.15,2165,3.75,17225,0.15,1746.25,3.75,17225,0.15,1986.25,3.75]
[null,17250,0.15,2168.75,3.75,17250,0.15,1750,3.75,17250,0.15,1990,3.75]
[null,17275,0.15,2172.5,3.75,17275,0.15,1753.75,3.75,17275,0.15,1993.75,3.75]
[null,17300,0.15,2176.25,3.75,17300,0.15,1757.5,3.75,17300,0.15,1997.5,3.75]
[null,17325,0.15,2180,3.75,17325,0.15,1761.25,3.75,17325,0.15,2001.25,3.75]
[null,17350,0.15,2183.75,3.75,17350,0.15,1765,3.75,17350,0.15,2005,3.75]
[null,17375,0.15,2187.5,3.75,17375,0.15,1768.75,3.75,17375,0.15,2008.75,3.75]
[null,17400,0.15,2191.25,3.75,17400,0.15,1772.5,3.75,17400,0.15,2012.5,3.75]
[null,17425,0.15,2195,3.75,17425,0.15,1776.25,3.75,17425,0.15,2016.25,3.75]
[null,17450,0.15,2198.75,3.75,17450,0.15,1780,3.75,17450,0.15,2020,3.75]
[null,17475,0.15,2202.5,3.75,17475,0.15,1783.75,3.75,17475,0.15,2023.75,3.75]
[null,17500,0.15,2206.25,3.75,17500,0.15,1787.5,3.75,17500,0.15,2027.5,3.75]
[null,17525,0.15,2210,3.75,17525,0.15,1791.25,3.75,17525,0.15,2031.25,3.75]
[null,17550,0.15,2213.75,3.75,17550,0.15,1795,3.75,17550,0.15,2035,3.75]
[null,17575,0.15,2217.5,3.75,17575,0.15,1798.75,3.75,17575,0.15,2038.75,3.75]
[null,17600,0.15,2221.25,3.75,17600,0.15,1802.5,3.75,17600,0.15,2042.5,3.75]
[null,17625,0.15,2225,3.75,17625,0.15,1806.25,{"$f":"+H714-H713","v":3.75},17625,0.15,2046.25,{"$f":"+L714-L713","v":3.75}]
[null,17650,0.15,2228.75,3.75,17650,0.15,1810,3.75,17650,0.15,2050,3.75]
[null,17675,0.15,2232.5,3.75,17675,0.15,1813.75,3.75,17675,0.15,2053.75,3.75]
[null,17700,0.15,2236.25,3.75,17700,0.15,1817.5,3.75,17700,0.15,2057.5,3.75]
[null,17725,0.15,2240,3.75,17725,0.15,1821.25,3.75,17725,0.15,2061.25,3.75]
[null,17750,0.15,2243.75,3.75,17750,0.15,1825,3.75,17750,0.15,2065,3.75]
[null,17775,0.15,2247.5,3.75,17775,0.15,1828.75,3.75,17775,0.15,2068.75,3.75]
[null,17800,0.15,2251.25,3.75,17800,0.15,1832.5,3.75,17800,0.15,2072.5,3.75]
[null,17825,0.15,2255,3.75,17825,0.15,1836.25,3.75,17825,0.15,2076.25,3.75]
[null,17850,0.15,2258.75,3.75,17850,0.15,1840,3.75,17850,0.15,2080,3.75]
[null,17875,0.15,2262.5,3.75,17875,0.15,1843.75,3.75,17875,0.15,2083.75,3.75]
[null,17900,0.15,2266.25,3.75,17900,0.15,1847.5,3.75,17900,0.15,2087.5,3.75]
[null,17925,0.15,2270,3.75,17925,0.15,1851.25,3.75,17925,0.15,2091.25,3.75]
[null,17950,0.15,2273.75,3.75,17950,0.15,1855,3.75,17950,0.15,2095,3.75]
[null,17975,0.15,2277.5,3.75,17975,0.15,1858.75,3.75,17975,0.15,2098.75,3.75]
[null,18000,0.15,{"$f":"+(B729-8375)*C729+837.5","v":2281.25},3.75,18000,0.15,1862.5,3.75,18000,0.15,2102.5,3.75]
[null,18025,0.15,2285,3.75,18025,0.15,1866.25,3.75,18025,0.15,2106.25,3.75]
[null,18050,0.15,2288.75,3.75,18050,0.15,1870,3.75,18050,0.15,2110,3.75]
[null,18075,0.15,2292.5,3.75,18075,0.15,1873.75,3.75,18075,0.15,2113.75,3.75]
[null,18100,0.15,2296.25,3.75,18100,0.15,1877.5,3.75,18100,0.15,2117.5,3.75]
[null,18125,0.15,2300,3.75,18125,0.15,1881.25,3.75,18125,0.15,2121.25,3.75]
[null,18150,0.15,2303.75,3.75,18150,0.15,1885,3.75,18150,0.15,2125,3.75]
[null,18175,0.15,2307.5,3.75,18175,0.15,1888.75,3.75,18175,0.15,2128.75,3.75]
[null,18200,0.15,2311.25,3.75,18200,0.15,1892.5,3.75,18200,0.15,2132.5,3.75]
[null,18225,0.15,2315,3.75,18225,0.15,1896.25,3.75,18225,0.15,2136.25,3.75]
[null,18250,0.15,2318.75,3.75,18250,0.15,1900,3.75,18250,0.15,2140,3.75]
[null,18275,0.15,2322.5,3.75,18275,0.15,1903.75,3.75,18275,0.15,2143.75,3.75]
[null,18300,0.15,2326.25,3.75,18300,0.15,1907.5,3.75,18300,0.15,2147.5,3.75]
[null,18325,0.15,2330,3.75,18325,0.15,1911.25,3.75,18325,0.15,2151.25,3.75]
[null,18350,0.15,2333.75,3.75,18350,0.15,1915,3.75,18350,0.15,2155,3.75]
[null,18375,0.15,2337.5,3.75,18375,0.15,{"$f":"+(F744-16750)*G744+$H$679","v":1918.75},3.75,18375,0.15,{"$f":"+(J744-11950)*K744+$L$487","v":2158.75},3.75]
[null,18400,0.15,2341.25,3.75,18400,0.15,1922.5,3.75,18400,0.15,2162.5,3.75]
[null,18425,0.15,2345,3.75,18425,0.15,1926.25,3.75,18425,0.15,2166.25,3.75]
[null,18450,0.15,2348.75,3.75,18450,0.15,1930,3.75,18450,0.15,2170,3.75]
[null,18475,0.15,2352.5,3.75,18475,0.15,1933.75,3.75,18475,0.15,2173.75,3.75]
[null,18500,0.15,2356.25,3.75,18500,0.15,1937.5,3.75,18500,0.15,2177.5,3.75]
[null,18525,0.15,2360,3.75,18525,0.15,1941.25,3.75,18525,0.15,2181.25,3.75]
[null,18550,0.15,2363.75,3.75,18550,0.15,1945,3.75,18550,0.15,2185,3.75]
[null,18575,0.15,2367.5,3.75,18575,0.15,1948.75,3.75,18575,0.15,2188.75,3.75]
[null,18600,0.15,2371.25,3.75,18600,0.15,1952.5,3.75,18600,0.15,2192.5,3.75]
[null,18625,0.15,2375,3.75,18625,0.15,1956.25,3.75,18625,0.15,2196.25,3.75]
[null,18650,0.15,2378.75,3.75,18650,0.15,1960,3.75,18650,0.15,2200,3.75]
[null,18675,0.15,2382.5,3.75,18675,0.15,1963.75,3.75,18675,0.15,2203.75,3.75]
[null,18700,0.15,2386.25,{"$f":"+D757-D756","v":3.75},18700,0.15,1967.5,3.75,18700,0.15,2207.5,3.75]
[null,18725,0.15,2390,3.75,18725,0.15,1971.25,3.75,18725,0.15,2211.25,3.75]
[null,18750,0.15,2393.75,3.75,18750,0.15,1975,3.75,18750,0.15,2215,3.75]
[null,18775,0.15,2397.5,3.75,18775,0.15,1978.75,3.75,18775,0.15,2218.75,3.75]
[null,18800,0.15,2401.25,3.75,18800,0.15,1982.5,3.75,18800,0.15,2222.5,3.75]
[null,18825,0.15,2405,3.75,18825,0.15,1986.25,3.75,18825,0.15,2226.25,3.75]
[null,18850,0.15,2408.75,3.75,18850,0.15,1990,3.75,18850,0.15,2230,3.75]
[null,18875,0.15,2412.5,3.75,18875,0.15,1993.75,3.75,18875,0.15,2233.75,3.75]
[null,18900,0.15,2416.25,3.75,18900,0.15,1997.5,3.75,18900,0.15,2237.5,3.75]
[null,18925,0.15,2420,3.75,18925,0.15,2001.25,3.75,18925,0.15,2241.25,3.75]
[null,18950,0.15,2423.75,3.75,18950,0.15,2005,3.75,18950,0.15,2245,3.75]
[null,18975,0.15,2427.5,3.75,18975,0.15,2008.75,3.75,18975,0.15,2248.75,3.75]
[null,19000,0.15,2431.25,3.75,19000,0.15,2012.5,3.75,19000,0.15,2252.5,3.75]
[null,19025,0.15,2435,3.75,19025,0.15,2016.25,3.75,19025,0.15,2256.25,3.75]
[null,19050,0.15,2438.75,3.75,19050,0.15,2020,3.75,19050,0.15,2260,3.75]
[null,19075,0.15,2442.5,3.75,19075,0.15,2023.75,3.75,19075,0.15,2263.75,3.75]
[null,19100,0.15,2446.25,3.75,19100,0.15,2027.5,3.75,19100,0.15,2267.5,3.75]
[null,19125,0.15,2450,3.75,19125,0.15,2031.25,3.75,19125,0.15,2271.25,3.75]
[null,19150,0.15,2453.75,3.75,19150,0.15,2035,3.75,19150,0.15,2275,3.75]
[null,19175,0.15,2457.5,3.75,19175,0.15,2038.75,3.75,19175,0.15,2278.75,3.75]
[null,19200,0.15,2461.25,3.75,19200,0.15,2042.5,3.75,19200,0.15,2282.5,3.75]
[null,19225,0.15,2465,3.75,19225,0.15,2046.25,{"$f":"+H778-H777","v":3.75},19225,0.15,2286.25,{"$f":"+L778-L777","v":3.75}]
[null,19250,0.15,2468.75,3.75,19250,0.15,2050,3.75,19250,0.15,2290,3.75]
[null,19275,0.15,2472.5,3.75,19275,0.15,2053.75,3.75,19275,0.15,2293.75,3.75]
[null,19300,0.15,2476.25,3.75,19300,0.15,2057.5,3.75,19300,0.15,2297.5,3.75]
[null,19325,0.15,2480,3.75,19325,0.15,2061.25,3.75,19325,0.15,2301.25,3.75]
[null,19350,0.15,2483.75,3.75,19350,0.15,2065,3.75,19350,0.15,2305,3.75]
[null,19375,0.15,2487.5,3.75,19375,0.15,2068.75,3.75,19375,0.15,2308.75,3.75]
[null,19400,0.15,2491.25,3.75,19400,0.15,2072.5,3.75,19400,0.15,2312.5,3.75]
[null,19425,0.15,2495,3.75,19425,0.15,2076.25,3.75,19425,0.15,2316.25,3.75]
[null,19450,0.15,2498.75,3.75,19450,0.15,2080,3.75,19450,0.15,2320,3.75]
[null,19475,0.15,2502.5,3.75,19475,0.15,2083.75,3.75,19475,0.15,2323.75,3.75]
[null,19500,0.15,2506.25,3.75,19500,0.15,2087.5,3.75,19500,0.15,2327.5,3.75]
[null,19525,0.15,2510,3.75,19525,0.15,2091.25,3.75,19525,0.15,2331.25,3.75]
[null,19550,0.15,2513.75,3.75,19550,0.15,2095,3.75,19550,0.15,2335,3.75]
[null,19575,0.15,2517.5,3.75,19575,0.15,2098.75,3.75,19575,0.15,2338.75,3.75]
[null,19600,0.15,{"$f":"+(B793-8375)*C793+837.5","v":2521.25},3.75,19600,0.15,2102.5,3.75,19600,0.15,2342.5,3.75]
[null,19625,0.15,2525,3.75,19625,0.15,2106.25,3.75,19625,0.15,2346.25,3.75]
[null,19650,0.15,2528.75,3.75,19650,0.15,2110,3.75,19650,0.15,2350,3.75]
[null,19675,0.15,2532.5,3.75,19675,0.15,2113.75,3.75,19675,0.15,2353.75,3.75]
[null,19700,0.15,2536.25,3.75,19700,0.15,2117.5,3.75,19700,0.15,2357.5,3.75]
[null,19725,0.15,2540,3.75,19725,0.15,2121.25,3.75,19725,0.15,2361.25,3.75]
[null,19750,0.15,2543.75,3.75,19750,0.15,2125,3.75,19750,0.15,2365,3.75]
[null,19775,0.15,2547.5,3.75,19775,0.15,2128.75,3.75,19775,0.15,2368.75,3.75]
[null,19800,0.15,2551.25,3.75,19800,0.15,2132.5,3.75,19800,0.15,2372.5,3.75]
[null,19825,0.15,2555,3.75,19825,0.15,2136.25,3.75,19825,0.15,2376.25,3.75]
[null,19850,0.15,2558.75,3.75,19850,0.15,2140,3.75,19850,0.15,2380,3.75]
[null,19875,0.15,2562.5,3.75,19875,0.15,2143.75,3.75,19875,0.15,2383.75,3.75]
[null,19900,0.15,2566.25,3.75,19900,0.15,2147.5,3.75,19900,0.15,2387.5,3.75]
[null,19925,0.15,2570,3.75,19925,0.15,2151.25,3.75,19925,0.15,2391.25,3.75]
[null,19950,0.15,2573.75,3.75,19950,0.15,2155,3.75,19950,0.15,2395,3.75]
[null,19975,0.15,2577.5,3.75,19975,0.15,{"$f":"+(F808-16750)*G808+$H$679","v":2158.75},3.75,19975,0.15,{"$f":"+(J808-11950)*K808+$L$487","v":2398.75},3.75]
[null,20000,0.15,2581.25,3.75,20000,0.15,2162.5,3.75,20000,0.15,2402.5,3.75]
[null,20025,0.15,2585,3.75,20025,0.15,2166.25,3.75,20025,0.15,2406.25,3.75]
[null,20050,0.15,2588.75,3.75,20050,0.15,2170,3.75,20050,0.15,2410,3.75]
[null,20075,0.15,2592.5,3.75,20075,0.15,2173.75,3.75,20075,0.15,2413.75,3.75]
[null,20100,0.15,2596.25,3.75,20100,0.15,2177.5,3.75,20100,0.15,2417.5,3.75]
[null,20125,0.15,2600,3.75,20125,0.15,2181.25,3.75,20125,0.15,2421.25,3.75]
[null,20150,0.15,2603.75,3.75,20150,0.15,2185,3.75,20150,0.15,2425,3.75]
[null,20175,0.15,2607.5,3.75,20175,0.15,2188.75,3.75,20175,0.15,2428.75,3.75]
[null,20200,0.15,2611.25,3.75,20200,0.15,2192.5,3.75,20200,0.15,2432.5,3.75]
[null,20225,0.15,2615,3.75,20225,0.15,2196.25,3.75,20225,0.15,2436.25,3.75]
[null,20250,0.15,2618.75,3.75,20250,0.15,2200,3.75,20250,0.15,2440,3.75]
[null,20275,0.15,2622.5,3.75,20275,0.15,2203.75,3.75,20275,0.15,2443.75,3.75]
[null,20300,0.15,2626.25,{"$f":"+D821-D820","v":3.75},20300,0.15,2207.5,3.75,20300,0.15,2447.5,3.75]
[null,20325,0.15,2630,3.75,20325,0.15,2211.25,3.75,20325,0.15,2451.25,3.75]
[null,20350,0.15,2633.75,3.75,20350,0.15,2215,3.75,20350,0.15,2455,3.75]
[null,20375,0.15,2637.5,3.75,20375,0.15,2218.75,3.75,20375,0.15,2458.75,3.75]
[null,20400,0.15,2641.25,3.75,20400,0.15,2222.5,3.75,20400,0.15,2462.5,3.75]
[null,20425,0.15,2645,3.75,20425,0.15,2226.25,3.75,20425,0.15,2466.25,3.75]
[null,20450,0.15,2648.75,3.75,20450,0.15,2230,3.75,20450,0.15,2470,3.75]
[null,20475,0.15,2652.5,3.75,20475,0.15,2233.75,3.75,20475,0.15,2473.75,3.75]
[null,20500,0.15,2656.25,3.75,20500,0.15,2237.5,3.75,20500,0.15,2477.5,3.75]
[null,20525,0.15,2660,3.75,20525,0.15,2241.25,3.75,20525,0.15,2481.25,3.75]
[null,20550,0.15,2663.75,3.75,20550,0.15,2245,3.75,20550,0.15,2485,3.75]
[null,20575,0.15,2667.5,3.75,20575,0.15,2248.75,3.75,20575,0.15,2488.75,3.75]
[null,20600,0.15,2671.25,3.75,20600,0.15,2252.5,3.75,20600,0.15,2492.5,3.75]
[null,20625,0.15,2675,3.75,20625,0.15,2256.25,3.75,20625,0.15,2496.25,3.75]
[null,20650,0.15,2678.75,3.75,20650,0.15,2260,3.75,20650,0.15,2500,3.75]
[null,20675,0.15,2682.5,3.75,20675,0.15,2263.75,3.75,20675,0.15,2503.75,3.75]
[null,20700,0.15,2686.25,3.75,20700,0.15,2267.5,3.75,20700,0.15,2507.5,3.75]
[null,20725,0.15,2690,3.75,20725,0.15,2271.25,3.75,20725,0.15,2511.25,3.75]
[null,20750,0.15,2693.75,3.75,20750,0.15,2275,3.75,20750,0.15,2515,3.75]
[null,20775,0.15,2697.5,3.75,20775,0.15,2278.75,3.75,20775,0.15,2518.75,3.75]
[null,20800,0.15,2701.25,3.75,20800,0.15,2282.5,3.75,20800,0.15,2522.5,3.75]
[null,20825,0.15,2705,3.75,20825,0.15,2286.25,{"$f":"+H842-H841","v":3.75},20825,0.15,2526.25,{"$f":"+L842-L841","v":3.75}]
[null,20850,0.15,2708.75,3.75,20850,0.15,2290,3.75,20850,0.15,2530,3.75]
[null,20875,0.15,2712.5,3.75,20875,0.15,2293.75,3.75,20875,0.15,2533.75,3.75]
[null,20900,0.15,2716.25,3.75,20900,0.15,2297.5,3.75,20900,0.15,2537.5,3.75]
[null,20925,0.15,2720,3.75,20925,0.15,2301.25,3.75,20925,0.15,2541.25,3.75]
[null,20950,0.15,2723.75,3.75,20950,0.15,2305,3.75,20950,0.15,2545,3.75]
[null,20975,0.15,2727.5,3.75,20975,0.15,2308.75,3.75,20975,0.15,2548.75,3.75]
[null,21000,0.15,2731.25,3.75,21000,0.15,2312.5,3.75,21000,0.15,2552.5,3.75]
[null,21025,0.15,2735,3.75,21025,0.15,2316.25,3.75,21025,0.15,2556.25,3.75]
[null,21050,0.15,2738.75,3.75,21050,0.15,2320,3.75,21050,0.15,2560,3.75]
[null,21075,0.15,2742.5,3.75,21075,0.15,2323.75,3.75,21075,0.15,2563.75,3.75]
[null,21100,0.15,2746.25,3.75,21100,0.15,2327.5,3.75,21100,0.15,2567.5,3.75]
[null,21125,0.15,2750,3.75,21125,0.15,2331.25,3.75,21125,0.15,2571.25,3.75]
[null,21150,0.15,2753.75,3.75,21150,0.15,2335,3.75,21150,0.15,2575,3.75]
[null,21175,0.15,2757.5,3.75,21175,0.15,2338.75,3.75,21175,0.15,2578.75,3.75]
[null,21200,0.15,{"$f":"+(B857-8375)*C857+837.5","v":2761.25},3.75,21200,0.15,2342.5,3.75,21200,0.15,2582.5,3.75]
[null,21225,0.15,2765,3.75,21225,0.15,2346.25,3.75,21225,0.15,2586.25,3.75]
[null,21250,0.15,2768.75,3.75,21250,0.15,2350,3.75,21250,0.15,2590,3.75]
[null,21275,0.15,2772.5,3.75,21275,0.15,2353.75,3.75,21275,0.15,2593.75,3.75]
[null,21300,0.15,2776.25,3.75,21300,0.15,2357.5,3.75,21300,0.15,2597.5,3.75]
[null,21325,0.15,2780,3.75,21325,0.15,2361.25,3.75,21325,0.15,2601.25,3.75]
[null,21350,0.15,2783.75,3.75,21350,0.15,2365,3.75,21350,0.15,2605,3.75]
[null,21375,0.15,2787.5,3.75,21375,0.15,2368.75,3.75,21375,0.15,2608.75,3.75]
[null,21400,0.15,2791.25,3.75,21400,0.15,2372.5,3.75,21400,0.15,2612.5,3.75]
[null,21425,0.15,2795,3.75,21425,0.15,2376.25,3.75,21425,0.15,2616.25,3.75]
[null,21450,0.15,2798.75,3.75,21450,0.15,2380,3.75,21450,0.15,2620,3.75]
[null,21475,0.15,2802.5,3.75,21475,0.15,2383.75,3.75,21475,0.15,2623.75,3.75]
[null,21500,0.15,2806.25,3.75,21500,0.15,2387.5,3.75,21500,0.15,2627.5,3.75]
[null,21525,0.15,2810,3.75,21525,0.15,2391.25,3.75,21525,0.15,2631.25,3.75]
[null,21550,0.15,2813.75,3.75,21550,0.15,2395,3.75,21550,0.15,2635,3.75]
[null,21575,0.15,2817.5,3.75,21575,0.15,{"$f":"+(F872-16750)*G872+$H$679","v":2398.75},3.75,21575,0.15,{"$f":"+(J872-11950)*K872+$L$487","v":2638.75},3.75]
[null,21600,0.15,2821.25,3.75,21600,0.15,2402.5,3.75,21600,0.15,2642.5,3.75]
[null,21625,0.15,2825,3.75,21625,0.15,2406.25,3.75,21625,0.15,2646.25,3.75]
[null,21650,0.15,2828.75,3.75,21650,0.15,2410,3.75,21650,0.15,2650,3.75]
[null,21675,0.15,2832.5,3.75,21675,0.15,2413.75,3.75,21675,0.15,2653.75,3.75]
[null,21700,0.15,2836.25,3.75,21700,0.15,2417.5,3.75,21700,0.15,2657.5,3.75]
[null,21725,0.15,2840,3.75,21725,0.15,2421.25,3.75,21725,0.15,2661.25,3.75]
[null,21750,0.15,2843.75,3.75,21750,0.15,2425,3.75,21750,0.15,2665,3.75]
[null,21775,0.15,2847.5,3.75,21775,0.15,2428.75,3.75,21775,0.15,2668.75,3.75]
[null,21800,0.15,2851.25,3.75,21800,0.15,2432.5,3.75,21800,0.15,2672.5,3.75]
[null,21825,0.15,2855,3.75,21825,0.15,2436.25,3.75,21825,0.15,2676.25,3.75]
[null,21850,0.15,2858.75,3.75,21850,0.15,2440,3.75,21850,0.15,2680,3.75]
[null,21875,0.15,2862.5,3.75,21875,0.15,2443.75,3.75,21875,0.15,2683.75,3.75]
[null,21900,0.15,2866.25,{"$f":"+D885-D884","v":3.75},21900,0.15,2447.5,3.75,21900,0.15,2687.5,3.75]
[null,21925,0.15,2870,3.75,21925,0.15,2451.25,3.75,21925,0.15,2691.25,3.75]
[null,21950,0.15,2873.75,3.75,21950,0.15,2455,3.75,21950,0.15,2695,3.75]
[null,21975,0.15,2877.5,3.75,21975,0.15,2458.75,3.75,21975,0.15,2698.75,3.75]
[null,22000,0.15,2881.25,3.75,22000,0.15,2462.5,3.75,22000,0.15,2702.5,3.75]
[null,22025,0.15,2885,3.75,22025,0.15,2466.25,3.75,22025,0.15,2706.25,3.75]
[null,22050,0.15,2888.75,3.75,22050,0.15,2470,3.75,22050,0.15,2710,3.75]
[null,22075,0.15,2892.5,3.75,22075,0.15,2473.75,3.75,22075,0.15,2713.75,3.75]
[null,22100,0.15,2896.25,3.75,22100,0.15,2477.5,3.75,22100,0.15,2717.5,3.75]
[null,22125,0.15,2900,3.75,22125,0.15,2481.25,3.75,22125,0.15,2721.25,3.75]
[null,22150,0.15,2903.75,3.75,22150,0.15,2485,3.75,22150,0.15,2725,3.75]
[null,22175,0.15,2907.5,3.75,22175,0.15,2488.75,3.75,22175,0.15,2728.75,3.75]
[null,22200,0.15,2911.25,3.75,22200,0.15,2492.5,3.75,22200,0.15,2732.5,3.75]
[null,22225,0.15,2915,3.75,22225,0.15,2496.25,3.75,22225,0.15,2736.25,3.75]
[null,22250,0.15,2918.75,3.75,22250,0.15,2500,3.75,22250,0.15,2740,3.75]
[null,22275,0.15,2922.5,3.75,22275,0.15,2503.75,3.75,22275,0.15,2743.75,3.75]
[null,22300,0.15,2926.25,3.75,22300,0.15,2507.5,3.75,22300,0.15,2747.5,3.75]
[null,22325,0.15,2930,3.75,22325,0.15,2511.25,3.75,22325,0.15,2751.25,3.75]
[null,22350,0.15,2933.75,3.75,22350,0.15,2515,3.75,22350,0.15,2755,3.75]
[null,22375,0.15,2937.5,3.75,22375,0.15,2518.75,3.75,22375,0.15,2758.75,3.75]
[null,22400,0.15,2941.25,3.75,22400,0.15,2522.5,3.75,22400,0.15,2762.5,3.75]
[null,22425,0.15,2945,3.75,22425,0.15,2526.25,{"$f":"+H906-H905","v":3.75},22425,0.15,2766.25,{"$f":"+L906-L905","v":3.75}]
[null,22450,0.15,2948.75,3.75,22450,0.15,2530,3.75,22450,0.15,2770,3.75]
[null,22475,0.15,2952.5,3.75,22475,0.15,2533.75,3.75,22475,0.15,2773.75,3.75]
[null,22500,0.15,2956.25,3.75,22500,0.15,2537.5,3.75,22500,0.15,2777.5,3.75]
[null,22525,0.15,2960,3.75,22525,0.15,2541.25,3.75,22525,0.15,2781.25,3.75]
[null,22550,0.15,2963.75,3.75,22550,0.15,2545,3.75,22550,0.15,2785,3.75]
[null,22575,0.15,2967.5,3.75,22575,0.15,2548.75,3.75,22575,0.15,2788.75,3.75]
[null,22600,0.15,2971.25,3.75,22600,0.15,2552.5,3.75,22600,0.15,2792.5,3.75]
[null,22625,0.15,2975,3.75,22625,0.15,2556.25,3.75,22625,0.15,2796.25,3.75]
[null,22650,0.15,2978.75,3.75,22650,0.15,2560,3.75,22650,0.15,2800,3.75]
[null,22675,0.15,2982.5,3.75,22675,0.15,2563.75,3.75,22675,0.15,2803.75,3.75]
[null,22700,0.15,2986.25,3.75,22700,0.15,2567.5,3.75,22700,0.15,2807.5,3.75]
[null,22725,0.15,2990,3.75,22725,0.15,2571.25,3.75,22725,0.15,2811.25,3.75]
[null,22750,0.15,2993.75,3.75,22750,0.15,2575,3.75,22750,0.15,2815,3.75]
[null,22775,0.15,2997.5,3.75,22775,0.15,2578.75,3.75,22775,0.15,2818.75,3.75]
[null,22800,0.15,{"$f":"+(B921-8375)*C921+837.5","v":3001.25},3.75,22800,0.15,2582.5,3.75,22800,0.15,2822.5,3.75]
[null,22825,0.15,3005,3.75,22825,0.15,2586.25,3.75,22825,0.15,2826.25,3.75]
[null,22850,0.15,3008.75,3.75,22850,0.15,2590,3.75,22850,0.15,2830,3.75]
[null,22875,0.15,3012.5,3.75,22875,0.15,2593.75,3.75,22875,0.15,2833.75,3.75]
[null,22900,0.15,3016.25,3.75,22900,0.15,2597.5,3.75,22900,0.15,2837.5,3.75]
[null,22925,0.15,3020,3.75,22925,0.15,2601.25,3.75,22925,0.15,2841.25,3.75]
[null,22950,0.15,3023.75,3.75,22950,0.15,2605,3.75,22950,0.15,2845,3.75]
[null,22975,0.15,3027.5,3.75,22975,0.15,2608.75,3.75,22975,0.15,2848.75,3.75]
[null,23000,0.15,3031.25,3.75,23000,0.15,2612.5,3.75,23000,0.15,2852.5,3.75]
[null,23025,0.15,3035,3.75,23025,0.15,2616.25,3.75,23025,0.15,2856.25,3.75]
[null,23050,0.15,3038.75,3.75,23050,0.15,2620,3.75,23050,0.15,2860,3.75]
[null,23075,0.15,3042.5,3.75,23075,0.15,2623.75,3.75,23075,0.15,2863.75,3.75]
[null,23100,0.15,3046.25,3.75,23100,0.15,2627.5,3.75,23100,0.15,2867.5,3.75]
[null,23125,0.15,3050,3.75,23125,0.15,2631.25,3.75,23125,0.15,2871.25,3.75]
[null,23150,0.15,3053.75,3.75,23150,0.15,2635,3.75,23150,0.15,2875,3.75]
[null,23175,0.15,3057.5,3.75,23175,0.15,{"$f":"+(F936-16750)*G936+$H$679","v":2638.75},3.75,23175,0.15,{"$f":"+(J936-11950)*K936+$L$487","v":2878.75},3.75]
[null,23200,0.15,3061.25,3.75,23200,0.15,2642.5,3.75,23200,0.15,2882.5,3.75]
[null,23225,0.15,3065,3.75,23225,0.15,2646.25,3.75,23225,0.15,2886.25,3.75]
[null,23250,0.15,3068.75,3.75,23250,0.15,2650,3.75,23250,0.15,2890,3.75]
[null,23275,0.15,3072.5,3.75,23275,0.15,2653.75,3.75,23275,0.15,2893.75,3.75]
[null,23300,0.15,3076.25,3.75,23300,0.15,2657.5,3.75,23300,0.15,2897.5,3.75]
[null,23325,0.15,3080,3.75,23325,0.15,2661.25,3.75,23325,0.15,2901.25,3.75]
[null,23350,0.15,3083.75,3.75,23350,0.15,2665,3.75,23350,0.15,2905,3.75]
[null,23375,0.15,3087.5,3.75,23375,0.15,2668.75,3.75,23375,0.15,2908.75,3.75]
[null,23400,0.15,3091.25,3.75,23400,0.15,2672.5,3.75,23400,0.15,2912.5,3.75]
[null,23425,0.15,3095,3.75,23425,0.15,2676.25,3.75,23425,0.15,2916.25,3.75]
[null,23450,0.15,3098.75,3.75,23450,0.15,2680,3.75,23450,0.15,2920,3.75]
[null,23475,0.15,3102.5,3.75,23475,0.15,2683.75,3.75,23475,0.15,2923.75,3.75]
[null,23500,0.15,3106.25,{"$f":"+D949-D948","v":3.75},23500,0.15,2687.5,3.75,23500,0.15,2927.5,3.75]
[null,23525,0.15,3110,3.75,23525,0.15,2691.25,3.75,23525,0.15,2931.25,3.75]
[null,23550,0.15,3113.75,3.75,23550,0.15,2695,3.75,23550,0.15,2935,3.75]
[null,23575,0.15,3117.5,3.75,23575,0.15,2698.75,3.75,23575,0.15,2938.75,3.75]
[null,23600,0.15,3121.25,3.75,23600,0.15,2702.5,3.75,23600,0.15,2942.5,3.75]
[null,23625,0.15,3125,3.75,23625,0.15,2706.25,3.75,23625,0.15,2946.25,3.75]
[null,23650,0.15,3128.75,3.75,23650,0.15,2710,3.75,23650,0.15,2950,3.75]
[null,23675,0.15,3132.5,3.75,23675,0.15,2713.75,3.75,23675,0.15,2953.75,3.75]
[null,23700,0.15,3136.25,3.75,23700,0.15,2717.5,3.75,23700,0.15,2957.5,3.75]
[null,23725,0.15,3140,3.75,23725,0.15,2721.25,3.75,23725,0.15,2961.25,3.75]
[null,23750,0.15,3143.75,3.75,23750,0.15,2725,3.75,23750,0.15,2965,3.75]
[null,23775,0.15,3147.5,3.75,23775,0.15,2728.75,3.75,23775,0.15,2968.75,3.75]
[null,23800,0.15,3151.25,3.75,23800,0.15,2732.5,3.75,23800,0.15,2972.5,3.75]
[null,23825,0.15,3155,3.75,23825,0.15,2736.25,3.75,23825,0.15,2976.25,3.75]
[null,23850,0.15,3158.75,3.75,23850,0.15,2740,3.75,23850,0.15,2980,3.75]
[null,23875,0.15,3162.5,3.75,23875,0.15,2743.75,3.75,23875,0.15,2983.75,3.75]
[null,23900,0.15,3166.25,3.75,23900,0.15,2747.5,3.75,23900,0.15,2987.5,3.75]
[null,23925,0.15,3170,3.75,23925,0.15,2751.25,3.75,23925,0.15,2991.25,3.75]
[null,23950,0.15,3173.75,3.75,23950,0.15,2755,3.75,23950,0.15,2995,3.75]
[null,23975,0.15,3177.5,3.75,23975,0.15,2758.75,3.75,23975,0.15,2998.75,3.75]
[null,24000,0.15,3181.25,3.75,24000,0.15,2762.5,3.75,24000,0.15,3002.5,3.75]
[null,24025,0.15,3185,3.75,24025,0.15,2766.25,{"$f":"+H970-H969","v":3.75},24025,0.15,3006.25,{"$f":"+L970-L969","v":3.75}]
[null,24050,0.15,3188.75,3.75,24050,0.15,2770,3.75,24050,0.15,3010,3.75]
[null,24075,0.15,3192.5,3.75,24075,0.15,2773.75,3.75,24075,0.15,3013.75,3.75]
[null,24100,0.15,3196.25,3.75,24100,0.15,2777.5,3.75,24100,0.15,3017.5,3.75]
[null,24125,0.15,3200,3.75,24125,0.15,2781.25,3.75,24125,0.15,3021.25,3.75]
[null,24150,0.15,3203.75,3.75,24150,0.15,2785,3.75,24150,0.15,3025,3.75]
[null,24175,0.15,3207.5,3.75,24175,0.15,2788.75,3.75,24175,0.15,3028.75,3.75]
[null,24200,0.15,3211.25,3.75,24200,0.15,2792.5,3.75,24200,0.15,3032.5,3.75]
[null,24225,0.15,3215,3.75,24225,0.15,2796.25,3.75,24225,0.15,3036.25,3.75]
[null,24250,0.15,3218.75,3.75,24250,0.15,2800,3.75,24250,0.15,3040,3.75]
[null,24275,0.15,3222.5,3.75,24275,0.15,2803.75,3.75,24275,0.15,3043.75,3.75]
[null,24300,0.15,3226.25,3.75,24300,0.15,2807.5,3.75,24300,0.15,3047.5,3.75]
[null,24325,0.15,3230,3.75,24325,0.15,2811.25,3.75,24325,0.15,3051.25,3.75]
[null,24350,0.15,3233.75,3.75,24350,0.15,2815,3.75,24350,0.15,3055,3.75]
[null,24375,0.15,3237.5,3.75,24375,0.15,2818.75,3.75,24375,0.15,3058.75,3.75]
[null,24400,0.15,{"$f":"+(B985-8375)*C985+837.5","v":3241.25},3.75,24400,0.15,2822.5,3.75,24400,0.15,3062.5,3.75]
[null,24425,0.15,3245,3.75,24425,0.15,2826.25,3.75,24425,0.15,3066.25,3.75]
[null,24450,0.15,3248.75,3.75,24450,0.15,2830,3.75,24450,0.15,3070,3.75]
[null,24475,0.15,3252.5,3.75,24475,0.15,2833.75,3.75,24475,0.15,3073.75,3.75]
[null,24500,0.15,3256.25,3.75,24500,0.15,2837.5,3.75,24500,0.15,3077.5,3.75]
[null,24525,0.15,3260,3.75,24525,0.15,2841.25,3.75,24525,0.15,3081.25,3.75]
[null,24550,0.15,3263.75,3.75,24550,0.15,2845,3.75,24550,0.15,3085,3.75]
[null,24575,0.15,3267.5,3.75,24575,0.15,2848.75,3.75,24575,0.15,3088.75,3.75]
[null,24600,0.15,3271.25,3.75,24600,0.15,2852.5,3.75,24600,0.15,3092.5,3.75]
[null,24625,0.15,3275,3.75,24625,0.15,2856.25,3.75,24625,0.15,3096.25,3.75]
[null,24650,0.15,3278.75,3.75,24650,0.15,2860,3.75,24650,0.15,3100,3.75]
[null,24675,0.15,3282.5,3.75,24675,0.15,2863.75,3.75,24675,0.15,3103.75,3.75]
[null,24700,0.15,3286.25,3.75,24700,0.15,2867.5,3.75,24700,0.15,3107.5,3.75]
[null,24725,0.15,3290,3.75,24725,0.15,2871.25,3.75,24725,0.15,3111.25,3.75]
[null,24750,0.15,3293.75,3.75,24750,0.15,2875,3.75,24750,0.15,3115,3.75]
[null,24775,0.15,3297.5,3.75,24775,0.15,{"$f":"+(F1000-16750)*G1000+$H$679","v":2878.75},3.75,24775,0.15,{"$f":"+(J1000-11950)*K1000+$L$487","v":3118.75},3.75]
[null,24800,0.15,3301.25,3.75,24800,0.15,2882.5,3.75,24800,0.15,3122.5,3.75]
[null,24825,0.15,3305,3.75,24825,0.15,2886.25,3.75,24825,0.15,3126.25,3.75]
[null,24850,0.15,3308.75,3.75,24850,0.15,2890,3.75,24850,0.15,3130,3.75]
[null,24875,0.15,3312.5,3.75,24875,0.15,2893.75,3.75,24875,0.15,3133.75,3.75]
[null,24900,0.15,3316.25,3.75,24900,0.15,2897.5,3.75,24900,0.15,3137.5,3.75]
[null,24925,0.15,3320,3.75,24925,0.15,2901.25,3.75,24925,0.15,3141.25,3.75]
[null,24950,0.15,3323.75,3.75,24950,0.15,2905,3.75,24950,0.15,3145,3.75]
[null,24975,0.15,3327.5,3.75,24975,0.15,2908.75,3.75,24975,0.15,3148.75,3.75]
[null,25000,0.15,3331.25,3.75,25000,0.15,2912.5,3.75,25000,0.15,3152.5,3.75]
[null,25025,0.15,3335,3.75,25025,0.15,2916.25,3.75,25025,0.15,3156.25,3.75]
[null,25050,0.15,3338.75,3.75,25050,0.15,2920,3.75,25050,0.15,3160,3.75]
[null,25075,0.15,3342.5,3.75,25075,0.15,2923.75,3.75,25075,0.15,3163.75,3.75]
[null,25100,0.15,3346.25,{"$f":"+D1013-D1012","v":3.75},25100,0.15,2927.5,3.75,25100,0.15,3167.5,3.75]
[null,25125,0.15,3350,3.75,25125,0.15,2931.25,3.75,25125,0.15,3171.25,3.75]
[null,25150,0.15,3353.75,3.75,25150,0.15,2935,3.75,25150,0.15,3175,3.75]
[null,25175,0.15,3357.5,3.75,25175,0.15,2938.75,3.75,25175,0.15,3178.75,3.75]
[null,25200,0.15,3361.25,3.75,25200,0.15,2942.5,3.75,25200,0.15,3182.5,3.75]
[null,25225,0.15,3365,3.75,25225,0.15,2946.25,3.75,25225,0.15,3186.25,3.75]
[null,25250,0.15,3368.75,3.75,25250,0.15,2950,3.75,25250,0.15,3190,3.75]
[null,25275,0.15,3372.5,3.75,25275,0.15,2953.75,3.75,25275,0.15,3193.75,3.75]
[null,25300,0.15,3376.25,3.75,25300,0.15,2957.5,3.75,25300,0.15,3197.5,3.75]
[null,25325,0.15,3380,3.75,25325,0.15,2961.25,3.75,25325,0.15,3201.25,3.75]
[null,25350,0.15,3383.75,3.75,25350,0.15,2965,3.75,25350,0.15,3205,3.75]
[null,25375,0.15,3387.5,3.75,25375,0.15,2968.75,3.75,25375,0.15,3208.75,3.75]
[null,25400,0.15,3391.25,3.75,25400,0.15,2972.5,3.75,25400,0.15,3212.5,3.75]
[null,25425,0.15,3395,3.75,25425,0.15,2976.25,3.75,25425,0.15,3216.25,3.75]
[null,25450,0.15,3398.75,3.75,25450,0.15,2980,3.75,25450,0.15,3220,3.75]
[null,25475,0.15,3402.5,3.75,25475,0.15,2983.75,3.75,25475,0.15,3223.75,3.75]
[null,25500,0.15,3406.25,3.75,25500,0.15,2987.5,3.75,25500,0.15,3227.5,3.75]
[null,25525,0.15,3410,3.75,25525,0.15,2991.25,3.75,25525,0.15,3231.25,3.75]
[null,25550,0.15,3413.75,3.75,25550,0.15,2995,3.75,25550,0.15,3235,3.75]
[null,25575,0.15,3417.5,3.75,25575,0.15,2998.75,3.75,25575,0.15,3238.75,3.75]
[null,25600,0.15,3421.25,3.75,25600,0.15,3002.5,3.75,25600,0.15,3242.5,3.75]
[null,25625,0.15,3425,3.75,25625,0.15,3006.25,{"$f":"+H1034-H1033","v":3.75},25625,0.15,3246.25,{"$f":"+L1034-L1033","v":3.75}]
[null,25650,0.15,3428.75,3.75,25650,0.15,3010,3.75,25650,0.15,3250,3.75]
[null,25675,0.15,3432.5,3.75,25675,0.15,3013.75,3.75,25675,0.15,3253.75,3.75]
[null,25700,0.15,3436.25,3.75,25700,0.15,3017.5,3.75,25700,0.15,3257.5,3.75]
[null,25725,0.15,3440,3.75,25725,0.15,3021.25,3.75,25725,0.15,3261.25,3.75]
[null,25750,0.15,3443.75,3.75,25750,0.15,3025,3.75,25750,0.15,3265,3.75]
[null,25775,0.15,3447.5,3.75,25775,0.15,3028.75,3.75,25775,0.15,3268.75,3.75]
[null,25800,0.15,3451.25,3.75,25800,0.15,3032.5,3.75,25800,0.15,3272.5,3.75]
[null,25825,0.15,3455,3.75,25825,0.15,3036.25,3.75,25825,0.15,3276.25,3.75]
[null,25850,0.15,3458.75,3.75,25850,0.15,3040,3.75,25850,0.15,3280,3.75]
[null,25875,0.15,3462.5,3.75,25875,0.15,3043.75,3.75,25875,0.15,3283.75,3.75]
[null,25900,0.15,3466.25,3.75,25900,0.15,3047.5,3.75,25900,0.15,3287.5,3.75]
[null,25925,0.15,3470,3.75,25925,0.15,3051.25,3.75,25925,0.15,3291.25,3.75]
[null,25950,0.15,3473.75,3.75,25950,0.15,3055,3.75,25950,0.15,3295,3.75]
[null,25975,0.15,3477.5,3.75,25975,0.15,3058.75,3.75,25975,0.15,3298.75,3.75]
[null,26000,0.15,{"$f":"+(B1049-8375)*C1049+837.5","v":3481.25},3.75,26000,0.15,3062.5,3.75,26000,0.15,3302.5,3.75]
[null,26025,0.15,3485,3.75,26025,0.15,3066.25,3.75,26025,0.15,3306.25,3.75]
[null,26050,0.15,3488.75,3.75,26050,0.15,3070,3.75,26050,0.15,3310,3.75]
[null,26075,0.15,3492.5,3.75,26075,0.15,3073.75,3.75,26075,0.15,3313.75,3.75]
[null,26100,0.15,3496.25,3.75,26100,0.15,3077.5,3.75,26100,0.15,3317.5,3.75]
[null,26125,0.15,3500,3.75,26125,0.15,3081.25,3.75,26125,0.15,3321.25,3.75]
[null,26150,0.15,3503.75,3.75,26150,0.15,3085,3.75,26150,0.15,3325,3.75]
[null,26175,0.15,3507.5,3.75,26175,0.15,3088.75,3.75,26175,0.15,3328.75,3.75]
[null,26200,0.15,3511.25,3.75,26200,0.15,3092.5,3.75,26200,0.15,3332.5,3.75]
[null,26225,0.15,3515,3.75,26225,0.15,3096.25,3.75,26225,0.15,3336.25,3.75]
[null,26250,0.15,3518.75,3.75,26250,0.15,3100,3.75,26250,0.15,3340,3.75]
[null,26275,0.15,3522.5,3.75,26275,0.15,3103.75,3.75,26275,0.15,3343.75,3.75]
[null,26300,0.15,3526.25,3.75,26300,0.15,3107.5,3.75,26300,0.15,3347.5,3.75]
[null,26325,0.15,3530,3.75,26325,0.15,3111.25,3.75,26325,0.15,3351.25,3.75]
[null,26350,0.15,3533.75,3.75,26350,0.15,3115,3.75,26350,0.15,3355,3.75]
[null,26375,0.15,3537.5,3.75,26375,0.15,{"$f":"+(F1064-16750)*G1064+$H$679","v":3118.75},3.75,26375,0.15,{"$f":"+(J1064-11950)*K1064+$L$487","v":3358.75},3.75]
[null,26400,0.15,3541.25,3.75,26400,0.15,3122.5,3.75,26400,0.15,3362.5,3.75]
[null,26425,0.15,3545,3.75,26425,0.15,3126.25,3.75,26425,0.15,3366.25,3.75]
[null,26450,0.15,3548.75,3.75,26450,0.15,3130,3.75,26450,0.15,3370,3.75]
[null,26475,0.15,3552.5,3.75,26475,0.15,3133.75,3.75,26475,0.15,3373.75,3.75]
[null,26500,0.15,3556.25,3.75,26500,0.15,3137.5,3.75,26500,0.15,3377.5,3.75]
[null,26525,0.15,3560,3.75,26525,0.15,3141.25,3.75,26525,0.15,3381.25,3.75]
[null,26550,0.15,3563.75,3.75,26550,0.15,3145,3.75,26550,0.15,3385,3.75]
[null,26575,0.15,3567.5,3.75,26575,0.15,3148.75,3.75,26575,0.15,3388.75,3.75]
[null,26600,0.15,3571.25,3.75,26600,0.15,3152.5,3.75,26600,0.15,3392.5,3.75]
[null,26625,0.15,3575,3.75,26625,0.15,3156.25,3.75,26625,0.15,3396.25,3.75]
[null,26650,0.15,3578.75,3.75,26650,0.15,3160,3.75,26650,0.15,3400,3.75]
[null,26675,0.15,3582.5,3.75,26675,0.15,3163.75,3.75,26675,0.15,3403.75,3.75]
[null,26700,0.15,3586.25,{"$f":"+D1077-D1076","v":3.75},26700,0.15,3167.5,3.75,26700,0.15,3407.5,3.75]
[null,26725,0.15,3590,3.75,26725,0.15,3171.25,3.75,26725,0.15,3411.25,3.75]
[null,26750,0.15,3593.75,3.75,26750,0.15,3175,3.75,26750,0.15,3415,3.75]
[null,26775,0.15,3597.5,3.75,26775,0.15,3178.75,3.75,26775,0.15,3418.75,3.75]
[null,26800,0.15,3601.25,3.75,26800,0.15,3182.5,3.75,26800,0.15,3422.5,3.75]
[null,26825,0.15,3605,3.75,26825,0.15,3186.25,3.75,26825,0.15,3426.25,3.75]
[null,26850,0.15,3608.75,3.75,26850,0.15,3190,3.75,26850,0.15,3430,3.75]
[null,26875,0.15,3612.5,3.75,26875,0.15,3193.75,3.75,26875,0.15,3433.75,3.75]
[null,26900,0.15,3616.25,3.75,26900,0.15,3197.5,3.75,26900,0.15,3437.5,3.75]
[null,26925,0.15,3620,3.75,26925,0.15,3201.25,3.75,26925,0.15,3441.25,3.75]
[null,26950,0.15,3623.75,3.75,26950,0.15,3205,3.75,26950,0.15,3445,3.75]
[null,26975,0.15,3627.5,3.75,26975,0.15,3208.75,3.75,26975,0.15,3448.75,3.75]
[null,27000,0.15,3631.25,3.75,27000,0.15,3212.5,3.75,27000,0.15,3452.5,3.75]
[null,27025,0.15,3635,3.75,27025,0.15,3216.25,3.75,27025,0.15,3456.25,3.75]
[null,27050,0.15,3638.75,3.75,27050,0.15,3220,3.75,27050,0.15,3460,3.75]
[null,27075,0.15,3642.5,3.75,27075,0.15,3223.75,3.75,27075,0.15,3463.75,3.75]
[null,27100,0.15,3646.25,3.75,27100,0.15,3227.5,3.75,27100,0.15,3467.5,3.75]
[null,27125,0.15,3650,3.75,27125,0.15,3231.25,3.75,27125,0.15,3471.25,3.75]
[null,27150,0.15,3653.75,3.75,27150,0.15,3235,3.75,27150,0.15,3475,3.75]
[null,27175,0.15,3657.5,3.75,27175,0.15,3238.75,3.75,27175,0.15,3478.75,3.75]
[null,27200,0.15,3661.25,3.75,27200,0.15,3242.5,3.75,27200,0.15,3482.5,3.75]
[null,27225,0.15,3665,3.75,27225,0.15,3246.25,{"$f":"+H1098-H1097","v":3.75},27225,0.15,3486.25,{"$f":"+L1098-L1097","v":3.75}]
[null,27250,0.15,3668.75,3.75,27250,0.15,3250,3.75,27250,0.15,3490,3.75]
[null,27275,0.15,3672.5,3.75,27275,0.15,3253.75,3.75,27275,0.15,3493.75,3.75]
[null,27300,0.15,3676.25,3.75,27300,0.15,3257.5,3.75,27300,0.15,3497.5,3.75]
[null,27325,0.15,3680,3.75,27325,0.15,3261.25,3.75,27325,0.15,3501.25,3.75]
[null,27350,0.15,3683.75,3.75,27350,0.15,3265,3.75,27350,0.15,3505,3.75]
[null,27375,0.15,3687.5,3.75,27375,0.15,3268.75,3.75,27375,0.15,3508.75,3.75]
[null,27400,0.15,3691.25,3.75,27400,0.15,3272.5,3.75,27400,0.15,3512.5,3.75]
[null,27425,0.15,3695,3.75,27425,0.15,3276.25,3.75,27425,0.15,3516.25,3.75]
[null,27450,0.15,3698.75,3.75,27450,0.15,3280,3.75,27450,0.15,3520,3.75]
[null,27475,0.15,3702.5,3.75,27475,0.15,3283.75,3.75,27475,0.15,3523.75,3.75]
[null,27500,0.15,3706.25,3.75,27500,0.15,3287.5,3.75,27500,0.15,3527.5,3.75]
[null,27525,0.15,3710,3.75,27525,0.15,3291.25,3.75,27525,0.15,3531.25,3.75]
[null,27550,0.15,3713.75,3.75,27550,0.15,3295,3.75,27550,0.15,3535,3.75]
[null,27575,0.15,3717.5,3.75,27575,0.15,3298.75,3.75,27575,0.15,3538.75,3.75]
[null,27600,0.15,{"$f":"+(B1113-8375)*C1113+837.5","v":3721.25},3.75,27600,0.15,3302.5,3.75,27600,0.15,3542.5,3.75]
[null,27625,0.15,3725,3.75,27625,0.15,3306.25,3.75,27625,0.15,3546.25,3.75]
[null,27650,0.15,3728.75,3.75,27650,0.15,3310,3.75,27650,0.15,3550,3.75]
[null,27675,0.15,3732.5,3.75,27675,0.15,3313.75,3.75,27675,0.15,3553.75,3.75]
[null,27700,0.15,3736.25,3.75,27700,0.15,3317.5,3.75,27700,0.15,3557.5,3.75]
[null,27725,0.15,3740,3.75,27725,0.15,3321.25,3.75,27725,0.15,3561.25,3.75]
[null,27750,0.15,3743.75,3.75,27750,0.15,3325,3.75,27750,0.15,3565,3.75]
[null,27775,0.15,3747.5,3.75,27775,0.15,3328.75,3.75,27775,0.15,3568.75,3.75]
[null,27800,0.15,3751.25,3.75,27800,0.15,3332.5,3.75,27800,0.15,3572.5,3.75]
[null,27825,0.15,3755,3.75,27825,0.15,3336.25,3.75,27825,0.15,3576.25,3.75]
[null,27850,0.15,3758.75,3.75,27850,0.15,3340,3.75,27850,0.15,3580,3.75]
[null,27875,0.15,3762.5,3.75,27875,0.15,3343.75,3.75,27875,0.15,3583.75,3.75]
[null,27900,0.15,3766.25,3.75,27900,0.15,3347.5,3.75,27900,0.15,3587.5,3.75]
[null,27925,0.15,3770,3.75,27925,0.15,3351.25,3.75,27925,0.15,3591.25,3.75]
[null,27950,0.15,3773.75,3.75,27950,0.15,3355,3.75,27950,0.15,3595,3.75]
[null,27975,0.15,3777.5,3.75,27975,0.15,{"$f":"+(F1128-16750)*G1128+$H$679","v":3358.75},3.75,27975,0.15,{"$f":"+(J1128-11950)*K1128+$L$487","v":3598.75},3.75]
[null,28000,0.15,3781.25,3.75,28000,0.15,3362.5,3.75,28000,0.15,3602.5,3.75]
[null,28025,0.15,3785,3.75,28025,0.15,3366.25,3.75,28025,0.15,3606.25,3.75]
[null,28050,0.15,3788.75,3.75,28050,0.15,3370,3.75,28050,0.15,3610,3.75]
[null,28075,0.15,3792.5,3.75,28075,0.15,3373.75,3.75,28075,0.15,3613.75,3.75]
[null,28100,0.15,3796.25,3.75,28100,0.15,3377.5,3.75,28100,0.15,3617.5,3.75]
[null,28125,0.15,3800,3.75,28125,0.15,3381.25,3.75,28125,0.15,3621.25,3.75]
[null,28150,0.15,3803.75,3.75,28150,0.15,3385,3.75,28150,0.15,3625,3.75]
[null,28175,0.15,3807.5,3.75,28175,0.15,3388.75,3.75,28175,0.15,3628.75,3.75]
[null,28200,0.15,3811.25,3.75,28200,0.15,3392.5,3.75,28200,0.15,3632.5,3.75]
[null,28225,0.15,3815,3.75,28225,0.15,3396.25,3.75,28225,0.15,3636.25,3.75]
[null,28250,0.15,3818.75,3.75,28250,0.15,3400,3.75,28250,0.15,3640,3.75]
[null,28275,0.15,3822.5,3.75,28275,0.15,3403.75,3.75,28275,0.15,3643.75,3.75]
[null,28300,0.15,3826.25,{"$f":"+D1141-D1140","v":3.75},28300,0.15,3407.5,3.75,28300,0.15,3647.5,3.75]
[null,28325,0.15,3830,3.75,28325,0.15,3411.25,3.75,28325,0.15,3651.25,3.75]
[null,28350,0.15,3833.75,3.75,28350,0.15,3415,3.75,28350,0.15,3655,3.75]
[null,28375,0.15,3837.5,3.75,28375,0.15,3418.75,3.75,28375,0.15,3658.75,3.75]
[null,28400,0.15,3841.25,3.75,28400,0.15,3422.5,3.75,28400,0.15,3662.5,3.75]
[null,28425,0.15,3845,3.75,28425,0.15,3426.25,3.75,28425,0.15,3666.25,3.75]
[null,28450,0.15,3848.75,3.75,28450,0.15,3430,3.75,28450,0.15,3670,3.75]
[null,28475,0.15,3852.5,3.75,28475,0.15,3433.75,3.75,28475,0.15,3673.75,3.75]
[null,28500,0.15,3856.25,3.75,28500,0.15,3437.5,3.75,28500,0.15,3677.5,3.75]
[null,28525,0.15,3860,3.75,28525,0.15,3441.25,3.75,28525,0.15,3681.25,3.75]
[null,28550,0.15,3863.75,3.75,28550,0.15,3445,3.75,28550,0.15,3685,3.75]
[null,28575,0.15,3867.5,3.75,28575,0.15,3448.75,3.75,28575,0.15,3688.75,3.75]
[null,28600,0.15,3871.25,3.75,28600,0.15,3452.5,3.75,28600,0.15,3692.5,3.75]
[null,28625,0.15,3875,3.75,28625,0.15,3456.25,3.75,28625,0.15,3696.25,3.75]
[null,28650,0.15,3878.75,3.75,28650,0.15,3460,3.75,28650,0.15,3700,3.75]
[null,28675,0.15,3882.5,3.75,28675,0.15,3463.75,3.75,28675,0.15,3703.75,3.75]
[null,28700,0.15,3886.25,3.75,28700,0.15,3467.5,3.75,28700,0.15,3707.5,3.75]
[null,28725,0.15,3890,3.75,28725,0.15,3471.25,3.75,28725,0.15,3711.25,3.75]
[null,28750,0.15,3893.75,3.75,28750,0.15,3475,3.75,28750,0.15,3715,3.75]
[null,28775,0.15,3897.5,3.75,28775,0.15,3478.75,3.75,28775,0.15,3718.75,3.75]
[null,28800,0.15,3901.25,3.75,28800,0.15,3482.5,3.75,28800,0.15,3722.5,3.75]
[null,28825,0.15,3905,3.75,28825,0.15,3486.25,{"$f":"+H1162-H1161","v":3.75},28825,0.15,3726.25,{"$f":"+L1162-L1161","v":3.75}]
[null,28850,0.15,3908.75,3.75,28850,0.15,3490,3.75,28850,0.15,3730,3.75]
[null,28875,0.15,3912.5,3.75,28875,0.15,3493.75,3.75,28875,0.15,3733.75,3.75]
[null,28900,0.15,3916.25,3.75,28900,0.15,3497.5,3.75,28900,0.15,3737.5,3.75]
[null,28925,0.15,3920,3.75,28925,0.15,3501.25,3.75,28925,0.15,3741.25,3.75]
[null,28950,0.15,3923.75,3.75,28950,0.15,3505,3.75,28950,0.15,3745,3.75]
[null,28975,0.15,3927.5,3.75,28975,0.15,3508.75,3.75,28975,0.15,3748.75,3.75]
[null,29000,0.15,3931.25,3.75,29000,0.15,3512.5,3.75,29000,0.15,3752.5,3.75]
[null,29025,0.15,3935,3.75,29025,0.15,3516.25,3.75,29025,0.15,3756.25,3.75]
[null,29050,0.15,3938.75,3.75,29050,0.15,3520,3.75,29050,0.15,3760,3.75]
[null,29075,0.15,3942.5,3.75,29075,0.15,3523.75,3.75,29075,0.15,3763.75,3.75]
[null,29100,0.15,3946.25,3.75,29100,0.15,3527.5,3.75,29100,0.15,3767.5,3.75]
[null,29125,0.15,3950,3.75,29125,0.15,3531.25,3.75,29125,0.15,3771.25,3.75]
[null,29150,0.15,3953.75,3.75,29150,0.15,3535,3.75,29150,0.15,3775,3.75]
[null,29175,0.15,3957.5,3.75,29175,0.15,3538.75,3.75,29175,0.15,3778.75,3.75]
[null,29200,0.15,{"$f":"+(B1177-8375)*C1177+837.5","v":3961.25},3.75,29200,0.15,3542.5,3.75,29200,0.15,3782.5,3.75]
[null,29225,0.15,3965,3.75,29225,0.15,3546.25,3.75,29225,0.15,3786.25,3.75]
[null,29250,0.15,3968.75,3.75,29250,0.15,3550,3.75,29250,0.15,3790,3.75]
[null,29275,0.15,3972.5,3.75,29275,0.15,3553.75,3.75,29275,0.15,3793.75,3.75]
[null,29300,0.15,3976.25,3.75,29300,0.15,3557.5,3.75,29300,0.15,3797.5,3.75]
[null,29325,0.15,3980,3.75,29325,0.15,3561.25,3.75,29325,0.15,3801.25,3.75]
[null,29350,0.15,3983.75,3.75,29350,0.15,3565,3.75,29350,0.15,3805,3.75]
[null,29375,0.15,3987.5,3.75,29375,0.15,3568.75,3.75,29375,0.15,3808.75,3.75]
[null,29400,0.15,3991.25,3.75,29400,0.15,3572.5,3.75,29400,0.15,3812.5,3.75]
[null,29425,0.15,3995,3.75,29425,0.15,3576.25,3.75,29425,0.15,3816.25,3.75]
[null,29450,0.15,3998.75,3.75,29450,0.15,3580,3.75,29450,0.15,3820,3.75]
[null,29475,0.15,4002.5,3.75,29475,0.15,3583.75,3.75,29475,0.15,3823.75,3.75]
[null,29500,0.15,4006.25,3.75,29500,0.15,3587.5,3.75,29500,0.15,3827.5,3.75]
[null,29525,0.15,4010,3.75,29525,0.15,3591.25,3.75,29525,0.15,3831.25,3.75]
[null,29550,0.15,4013.75,3.75,29550,0.15,3595,3.75,29550,0.15,3835,3.75]
[null,29575,0.15,4017.5,3.75,29575,0.15,{"$f":"+(F1192-16750)*G1192+$H$679","v":3598.75},3.75,29575,0.15,{"$f":"+(J1192-11950)*K1192+$L$487","v":3838.75},3.75]
[null,29600,0.15,4021.25,3.75,29600,0.15,3602.5,3.75,29600,0.15,3842.5,3.75]
[null,29625,0.15,4025,3.75,29625,0.15,3606.25,3.75,29625,0.15,3846.25,3.75]
[null,29650,0.15,4028.75,3.75,29650,0.15,3610,3.75,29650,0.15,3850,3.75]
[null,29675,0.15,4032.5,3.75,29675,0.15,3613.75,3.75,29675,0.15,3853.75,3.75]
[null,29700,0.15,4036.25,3.75,29700,0.15,3617.5,3.75,29700,0.15,3857.5,3.75]
[null,29725,0.15,4040,3.75,29725,0.15,3621.25,3.75,29725,0.15,3861.25,3.75]
[null,29750,0.15,4043.75,3.75,29750,0.15,3625,3.75,29750,0.15,3865,3.75]
[null,29775,0.15,4047.5,3.75,29775,0.15,3628.75,3.75,29775,0.15,3868.75,3.75]
[null,29800,0.15,4051.25,3.75,29800,0.15,3632.5,3.75,29800,0.15,3872.5,3.75]
[null,29825,0.15,4055,3.75,29825,0.15,3636.25,3.75,29825,0.15,3876.25,3.75]
[null,29850,0.15,4058.75,3.75,29850,0.15,3640,3.75,29850,0.15,3880,3.75]
[null,29875,0.15,4062.5,3.75,29875,0.15,3643.75,3.75,29875,0.15,3883.75,3.75]
[null,29900,0.15,4066.25,{"$f":"+D1205-D1204","v":3.75},29900,0.15,3647.5,3.75,29900,0.15,3887.5,3.75]
[null,29925,0.15,4070,3.75,29925,0.15,3651.25,3.75,29925,0.15,3891.25,3.75]
[null,29950,0.15,4073.75,3.75,29950,0.15,3655,3.75,29950,0.15,3895,3.75]
[null,29975,0.15,4077.5,3.75,29975,0.15,3658.75,3.75,29975,0.15,3898.75,3.75]
[null,30000,0.15,4081.25,3.75,30000,0.15,3662.5,3.75,30000,0.15,3902.5,3.75]
[null,30025,0.15,4085,3.75,30025,0.15,3666.25,3.75,30025,0.15,3906.25,3.75]
[null,30050,0.15,4088.75,3.75,30050,0.15,3670,3.75,30050,0.15,3910,3.75]
[null,30075,0.15,4092.5,3.75,30075,0.15,3673.75,3.75,30075,0.15,3913.75,3.75]
[null,30100,0.15,4096.25,3.75,30100,0.15,3677.5,3.75,30100,0.15,3917.5,3.75]
[null,30125,0.15,4100,3.75,30125,0.15,3681.25,3.75,30125,0.15,3921.25,3.75]
[null,30150,0.15,4103.75,3.75,30150,0.15,3685,3.75,30150,0.15,3925,3.75]
[null,30175,0.15,4107.5,3.75,30175,0.15,3688.75,3.75,30175,0.15,3928.75,3.75]
[null,30200,0.15,4111.25,3.75,30200,0.15,3692.5,3.75,30200,0.15,3932.5,3.75]
[null,30225,0.15,4115,3.75,30225,0.15,3696.25,3.75,30225,0.15,3936.25,3.75]
[null,30250,0.15,4118.75,3.75,30250,0.15,3700,3.75,30250,0.15,3940,3.75]
[null,30275,0.15,4122.5,3.75,30275,0.15,3703.75,3.75,30275,0.15,3943.75,3.75]
[null,30300,0.15,4126.25,3.75,30300,0.15,3707.5,3.75,30300,0.15,3947.5,3.75]
[null,30325,0.15,4130,3.75,30325,0.15,3711.25,3.75,30325,0.15,3951.25,3.75]
[null,30350,0.15,4133.75,3.75,30350,0.15,3715,3.75,30350,0.15,3955,3.75]
[null,30375,0.15,4137.5,3.75,30375,0.15,3718.75,3.75,30375,0.15,3958.75,3.75]
[null,30400,0.15,4141.25,3.75,30400,0.15,3722.5,3.75,30400,0.15,3962.5,3.75]
[null,30425,0.15,4145,3.75,30425,0.15,3726.25,{"$f":"+H1226-H1225","v":3.75},30425,0.15,3966.25,{"$f":"+L1226-L1225","v":3.75}]
[null,30450,0.15,4148.75,3.75,30450,0.15,3730,3.75,30450,0.15,3970,3.75]
[null,30475,0.15,4152.5,3.75,30475,0.15,3733.75,3.75,30475,0.15,3973.75,3.75]
[null,30500,0.15,4156.25,3.75,30500,0.15,3737.5,3.75,30500,0.15,3977.5,3.75]
[null,30525,0.15,4160,3.75,30525,0.15,3741.25,3.75,30525,0.15,3981.25,3.75]
[null,30550,0.15,4163.75,3.75,30550,0.15,3745,3.75,30550,0.15,3985,3.75]
[null,30575,0.15,4167.5,3.75,30575,0.15,3748.75,3.75,30575,0.15,3988.75,3.75]
[null,30600,0.15,4171.25,3.75,30600,0.15,3752.5,3.75,30600,0.15,3992.5,3.75]
[null,30625,0.15,4175,3.75,30625,0.15,3756.25,3.75,30625,0.15,3996.25,3.75]
[null,30650,0.15,4178.75,3.75,30650,0.15,3760,3.75,30650,0.15,4000,3.75]
[null,30675,0.15,4182.5,3.75,30675,0.15,3763.75,3.75,30675,0.15,4003.75,3.75]
[null,30700,0.15,4186.25,3.75,30700,0.15,3767.5,3.75,30700,0.15,4007.5,3.75]
[null,30725,0.15,4190,3.75,30725,0.15,3771.25,3.75,30725,0.15,4011.25,3.75]
[null,30750,0.15,4193.75,3.75,30750,0.15,3775,3.75,30750,0.15,4015,3.75]
[null,30775,0.15,4197.5,3.75,30775,0.15,3778.75,3.75,30775,0.15,4018.75,3.75]
[null,30800,0.15,{"$f":"+(B1241-8375)*C1241+837.5","v":4201.25},3.75,30800,0.15,3782.5,3.75,30800,0.15,4022.5,3.75]
[null,30825,0.15,4205,3.75,30825,0.15,3786.25,3.75,30825,0.15,4026.25,3.75]
[null,30850,0.15,4208.75,3.75,30850,0.15,3790,3.75,30850,0.15,4030,3.75]
[null,30875,0.15,4212.5,3.75,30875,0.15,3793.75,3.75,30875,0.15,4033.75,3.75]
[null,30900,0.15,4216.25,3.75,30900,0.15,3797.5,3.75,30900,0.15,4037.5,3.75]
[null,30925,0.15,4220,3.75,30925,0.15,3801.25,3.75,30925,0.15,4041.25,3.75]
[null,30950,0.15,4223.75,3.75,30950,0.15,3805,3.75,30950,0.15,4045,3.75]
[null,30975,0.15,4227.5,3.75,30975,0.15,3808.75,3.75,30975,0.15,4048.75,3.75]
[null,31000,0.15,4231.25,3.75,31000,0.15,3812.5,3.75,31000,0.15,4052.5,3.75]
[null,31025,0.15,4235,3.75,31025,0.15,3816.25,3.75,31025,0.15,4056.25,3.75]
[null,31050,0.15,4238.75,3.75,31050,0.15,3820,3.75,31050,0.15,4060,3.75]
[null,31075,0.15,4242.5,3.75,31075,0.15,3823.75,3.75,31075,0.15,4063.75,3.75]
[null,31100,0.15,4246.25,3.75,31100,0.15,3827.5,3.75,31100,0.15,4067.5,3.75]
[null,31125,0.15,4250,3.75,31125,0.15,3831.25,3.75,31125,0.15,4071.25,3.75]
[null,31150,0.15,4253.75,3.75,31150,0.15,3835,3.75,31150,0.15,4075,3.75]
[null,31175,0.15,4257.5,3.75,31175,0.15,{"$f":"+(F1256-16750)*G1256+$H$679","v":3838.75},3.75,31175,0.15,{"$f":"+(J1256-11950)*K1256+$L$487","v":4078.75},3.75]
[null,31200,0.15,4261.25,3.75,31200,0.15,3842.5,3.75,31200,0.15,4082.5,3.75]
[null,31225,0.15,4265,3.75,31225,0.15,3846.25,3.75,31225,0.15,4086.25,3.75]
[null,31250,0.15,4268.75,3.75,31250,0.15,3850,3.75,31250,0.15,4090,3.75]
[null,31275,0.15,4272.5,3.75,31275,0.15,3853.75,3.75,31275,0.15,4093.75,3.75]
[null,31300,0.15,4276.25,3.75,31300,0.15,3857.5,3.75,31300,0.15,4097.5,3.75]
[null,31325,0.15,4280,3.75,31325,0.15,3861.25,3.75,31325,0.15,4101.25,3.75]
[null,31350,0.15,4283.75,3.75,31350,0.15,3865,3.75,31350,0.15,4105,3.75]
[null,31375,0.15,4287.5,3.75,31375,0.15,3868.75,3.75,31375,0.15,4108.75,3.75]
[null,31400,0.15,4291.25,3.75,31400,0.15,3872.5,3.75,31400,0.15,4112.5,3.75]
[null,31425,0.15,4295,3.75,31425,0.15,3876.25,3.75,31425,0.15,4116.25,3.75]
[null,31450,0.15,4298.75,3.75,31450,0.15,3880,3.75,31450,0.15,4120,3.75]
[null,31475,0.15,4302.5,3.75,31475,0.15,3883.75,3.75,31475,0.15,4123.75,3.75]
[null,31500,0.15,4306.25,{"$f":"+D1269-D1268","v":3.75},31500,0.15,3887.5,3.75,31500,0.15,4127.5,3.75]
[null,31525,0.15,4310,3.75,31525,0.15,3891.25,3.75,31525,0.15,4131.25,3.75]
[null,31550,0.15,4313.75,3.75,31550,0.15,3895,3.75,31550,0.15,4135,3.75]
[null,31575,0.15,4317.5,3.75,31575,0.15,3898.75,3.75,31575,0.15,4138.75,3.75]
[null,31600,0.15,4321.25,3.75,31600,0.15,3902.5,3.75,31600,0.15,4142.5,3.75]
[null,31625,0.15,4325,3.75,31625,0.15,3906.25,3.75,31625,0.15,4146.25,3.75]
[null,31650,0.15,4328.75,3.75,31650,0.15,3910,3.75,31650,0.15,4150,3.75]
[null,31675,0.15,4332.5,3.75,31675,0.15,3913.75,3.75,31675,0.15,4153.75,3.75]
[null,31700,0.15,4336.25,3.75,31700,0.15,3917.5,3.75,31700,0.15,4157.5,3.75]
[null,31725,0.15,4340,3.75,31725,0.15,3921.25,3.75,31725,0.15,4161.25,3.75]
[null,31750,0.15,4343.75,3.75,31750,0.15,3925,3.75,31750,0.15,4165,3.75]
[null,31775,0.15,4347.5,3.75,31775,0.15,3928.75,3.75,31775,0.15,4168.75,3.75]
[null,31800,0.15,4351.25,3.75,31800,0.15,3932.5,3.75,31800,0.15,4172.5,3.75]
[null,31825,0.15,4355,3.75,31825,0.15,3936.25,3.75,31825,0.15,4176.25,3.75]
[null,31850,0.15,4358.75,3.75,31850,0.15,3940,3.75,31850,0.15,4180,3.75]
[null,31875,0.15,4362.5,3.75,31875,0.15,3943.75,3.75,31875,0.15,4183.75,3.75]
[null,31900,0.15,4366.25,3.75,31900,0.15,3947.5,3.75,31900,0.15,4187.5,3.75]
[null,31925,0.15,4370,3.75,31925,0.15,3951.25,3.75,31925,0.15,4191.25,3.75]
[null,31950,0.15,4373.75,3.75,31950,0.15,3955,3.75,31950,0.15,4195,3.75]
[null,31975,0.15,4377.5,3.75,31975,0.15,3958.75,3.75,31975,0.15,4198.75,3.75]
[null,32000,0.15,4381.25,3.75,32000,0.15,3962.5,3.75,32000,0.15,4202.5,3.75]
[null,32025,0.15,4385,3.75,32025,0.15,3966.25,{"$f":"+H1290-H1289","v":3.75},32025,0.15,4206.25,{"$f":"+L1290-L1289","v":3.75}]
[null,32050,0.15,4388.75,3.75,32050,0.15,3970,3.75,32050,0.15,4210,3.75]
[null,32075,0.15,4392.5,3.75,32075,0.15,3973.75,3.75,32075,0.15,4213.75,3.75]
[null,32100,0.15,4396.25,3.75,32100,0.15,3977.5,3.75,32100,0.15,4217.5,3.75]
[null,32125,0.15,4400,3.75,32125,0.15,3981.25,3.75,32125,0.15,4221.25,3.75]
[null,32150,0.15,4403.75,3.75,32150,0.15,3985,3.75,32150,0.15,4225,3.75]
[null,32175,0.15,4407.5,3.75,32175,0.15,3988.75,3.75,32175,0.15,4228.75,3.75]
[null,32200,0.15,4411.25,3.75,32200,0.15,3992.5,3.75,32200,0.15,4232.5,3.75]
[null,32225,0.15,4415,3.75,32225,0.15,3996.25,3.75,32225,0.15,4236.25,3.75]
[null,32250,0.15,4418.75,3.75,32250,0.15,4000,3.75,32250,0.15,4240,3.75]
[null,32275,0.15,4422.5,3.75,32275,0.15,4003.75,3.75,32275,0.15,4243.75,3.75]
[null,32300,0.15,4426.25,3.75,32300,0.15,4007.5,3.75,32300,0.15,4247.5,3.75]
[null,32325,0.15,4430,3.75,32325,0.15,4011.25,3.75,32325,0.15,4251.25,3.75]
[null,32350,0.15,4433.75,3.75,32350,0.15,4015,3.75,32350,0.15,4255,3.75]
[null,32375,0.15,4437.5,3.75,32375,0.15,4018.75,3.75,32375,0.15,4258.75,3.75]
[null,32400,0.15,{"$f":"+(B1305-8375)*C1305+837.5","v":4441.25},3.75,32400,0.15,4022.5,3.75,32400,0.15,4262.5,3.75]
[null,32425,0.15,4445,3.75,32425,0.15,4026.25,3.75,32425,0.15,4266.25,3.75]
[null,32450,0.15,4448.75,3.75,32450,0.15,4030,3.75,32450,0.15,4270,3.75]
[null,32475,0.15,4452.5,3.75,32475,0.15,4033.75,3.75,32475,0.15,4273.75,3.75]
[null,32500,0.15,4456.25,3.75,32500,0.15,4037.5,3.75,32500,0.15,4277.5,3.75]
[null,32525,0.15,4460,3.75,32525,0.15,4041.25,3.75,32525,0.15,4281.25,3.75]
[null,32550,0.15,4463.75,3.75,32550,0.15,4045,3.75,32550,0.15,4285,3.75]
[null,32575,0.15,4467.5,3.75,32575,0.15,4048.75,3.75,32575,0.15,4288.75,3.75]
[null,32600,0.15,4471.25,3.75,32600,0.15,4052.5,3.75,32600,0.15,4292.5,3.75]
[null,32625,0.15,4475,3.75,32625,0.15,4056.25,3.75,32625,0.15,4296.25,3.75]
[null,32650,0.15,4478.75,3.75,32650,0.15,4060,3.75,32650,0.15,4300,3.75]
[null,32675,0.15,4482.5,3.75,32675,0.15,4063.75,3.75,32675,0.15,4303.75,3.75]
[null,32700,0.15,4486.25,3.75,32700,0.15,4067.5,3.75,32700,0.15,4307.5,3.75]
[null,32725,0.15,4490,3.75,32725,0.15,4071.25,3.75,32725,0.15,4311.25,3.75]
[null,32750,0.15,4493.75,3.75,32750,0.15,4075,3.75,32750,0.15,4315,3.75]
[null,32775,0.15,4497.5,3.75,32775,0.15,{"$f":"+(F1320-16750)*G1320+$H$679","v":4078.75},3.75,32775,0.15,{"$f":"+(J1320-11950)*K1320+$L$487","v":4318.75},3.75]
[null,32800,0.15,4501.25,3.75,32800,0.15,4082.5,3.75,32800,0.15,4322.5,3.75]
[null,32825,0.15,4505,3.75,32825,0.15,4086.25,3.75,32825,0.15,4326.25,3.75]
[null,32850,0.15,4508.75,3.75,32850,0.15,4090,3.75,32850,0.15,4330,3.75]
[null,32875,0.15,4512.5,3.75,32875,0.15,4093.75,3.75,32875,0.15,4333.75,3.75]
[null,32900,0.15,4516.25,3.75,32900,0.15,4097.5,3.75,32900,0.15,4337.5,3.75]
[null,32925,0.15,4520,3.75,32925,0.15,4101.25,3.75,32925,0.15,4341.25,3.75]
[null,32950,0.15,4523.75,3.75,32950,0.15,4105,3.75,32950,0.15,4345,3.75]
[null,32975,0.15,4527.5,3.75,32975,0.15,4108.75,3.75,32975,0.15,4348.75,3.75]
[null,33000,0.15,4531.25,3.75,33000,0.15,4112.5,3.75,33000,0.15,4352.5,3.75]
[null,33025,0.15,4535,3.75,33025,0.15,4116.25,3.75,33025,0.15,4356.25,3.75]
[null,33050,0.15,4538.75,3.75,33050,0.15,4120,3.75,33050,0.15,4360,3.75]
[null,33075,0.15,4542.5,3.75,33075,0.15,4123.75,3.75,33075,0.15,4363.75,3.75]
[null,33100,0.15,4546.25,{"$f":"+D1333-D1332","v":3.75},33100,0.15,4127.5,3.75,33100,0.15,4367.5,3.75]
[null,33125,0.15,4550,3.75,33125,0.15,4131.25,3.75,33125,0.15,4371.25,3.75]
[null,33150,0.15,4553.75,3.75,33150,0.15,4135,3.75,33150,0.15,4375,3.75]
[null,33175,0.15,4557.5,3.75,33175,0.15,4138.75,3.75,33175,0.15,4378.75,3.75]
[null,33200,0.15,4561.25,3.75,33200,0.15,4142.5,3.75,33200,0.15,4382.5,3.75]
[null,33225,0.15,4565,3.75,33225,0.15,4146.25,3.75,33225,0.15,4386.25,3.75]
[null,33250,0.15,4568.75,3.75,33250,0.15,4150,3.75,33250,0.15,4390,3.75]
[null,33275,0.15,4572.5,3.75,33275,0.15,4153.75,3.75,33275,0.15,4393.75,3.75]
[null,33300,0.15,4576.25,3.75,33300,0.15,4157.5,3.75,33300,0.15,4397.5,3.75]
[null,33325,0.15,4580,3.75,33325,0.15,4161.25,3.75,33325,0.15,4401.25,3.75]
[null,33350,0.15,4583.75,3.75,33350,0.15,4165,3.75,33350,0.15,4405,3.75]
[null,33375,0.15,4587.5,3.75,33375,0.15,4168.75,3.75,33375,0.15,4408.75,3.75]
[null,33400,0.15,4591.25,3.75,33400,0.15,4172.5,3.75,33400,0.15,4412.5,3.75]
[null,33425,0.15,4595,3.75,33425,0.15,4176.25,3.75,33425,0.15,4416.25,3.75]
[null,33450,0.15,4598.75,3.75,33450,0.15,4180,3.75,33450,0.15,4420,3.75]
[null,33475,0.15,4602.5,3.75,33475,0.15,4183.75,3.75,33475,0.15,4423.75,3.75]
[null,33500,0.15,4606.25,3.75,33500,0.15,4187.5,3.75,33500,0.15,4427.5,3.75]
[null,33525,0.15,4610,3.75,33525,0.15,4191.25,3.75,33525,0.15,4431.25,3.75]
[null,33550,0.15,4613.75,3.75,33550,0.15,4195,3.75,33550,0.15,4435,3.75]
[null,33575,0.15,4617.5,3.75,33575,0.15,4198.75,3.75,33575,0.15,4438.75,3.75]
[null,33600,0.15,4621.25,3.75,33600,0.15,4202.5,3.75,33600,0.15,4442.5,3.75]
[null,33625,0.15,4625,3.75,33625,0.15,4206.25,{"$f":"+H1354-H1353","v":3.75},33625,0.15,4446.25,{"$f":"+L1354-L1353","v":3.75}]
[null,33650,0.15,4628.75,3.75,33650,0.15,4210,3.75,33650,0.15,4450,3.75]
[null,33675,0.15,4632.5,3.75,33675,0.15,4213.75,3.75,33675,0.15,4453.75,3.75]
[null,33700,0.15,4636.25,3.75,33700,0.15,4217.5,3.75,33700,0.15,4457.5,3.75]
[null,33725,0.15,4640,3.75,33725,0.15,4221.25,3.75,33725,0.15,4461.25,3.75]
[null,33750,0.15,4643.75,3.75,33750,0.15,4225,3.75,33750,0.15,4465,3.75]
[null,33775,0.15,4647.5,3.75,33775,0.15,4228.75,3.75,33775,0.15,4468.75,3.75]
[null,33800,0.15,4651.25,3.75,33800,0.15,4232.5,3.75,33800,0.15,4472.5,3.75]
[null,33825,0.15,4655,3.75,33825,0.15,4236.25,3.75,33825,0.15,4476.25,3.75]
[null,33850,0.15,4658.75,3.75,33850,0.15,4240,3.75,33850,0.15,4480,3.75]
[null,33875,0.15,4662.5,3.75,33875,0.15,4243.75,3.75,33875,0.15,4483.75,3.75]
[null,33900,0.15,4666.25,3.75,33900,0.15,4247.5,3.75,33900,0.15,4487.5,3.75]
[null,33925,0.15,4670,3.75,33925,0.15,4251.25,3.75,33925,0.15,4491.25,3.75]
[null,33950,0.15,4673.75,3.75,33950,0.15,4255,3.75,33950,0.15,4495,3.75]
[null,33975,0.15,4677.5,3.75,33975,0.15,4258.75,3.75,33975,0.15,4498.75,3.75]
[null,34000,0.15,{"$f":"+(B1369-8375)*C1369+837.5","v":4681.25},3.75,34000,0.15,4262.5,3.75,34000,0.15,4502.5,3.75]
[null,34025,0.25,{"$f":"+(B1370-34000)*C1370+$D$1369","v":4687.5},6.25,34025,0.15,4266.25,3.75,34025,0.15,4506.25,3.75]
[null,34050,0.25,4693.75,6.25,34050,0.15,4270,3.75,34050,0.15,4510,3.75]
[null,34075,0.25,4700,6.25,34075,0.15,4273.75,3.75,34075,0.15,4513.75,3.75]
[null,34100,0.25,4706.25,6.25,34100,0.15,4277.5,3.75,34100,0.15,4517.5,3.75]
[null,34125,0.25,4712.5,6.25,34125,0.15,4281.25,3.75,34125,0.15,4521.25,3.75]
[null,34150,0.25,4718.75,6.25,34150,0.15,4285,3.75,34150,0.15,4525,3.75]
[null,34175,0.25,4725,6.25,34175,0.15,4288.75,3.75,34175,0.15,4528.75,3.75]
[null,34200,0.25,4731.25,6.25,34200,0.15,4292.5,3.75,34200,0.15,4532.5,3.75]
[null,34225,0.25,4737.5,6.25,34225,0.15,4296.25,3.75,34225,0.15,4536.25,3.75]
[null,34250,0.25,4743.75,6.25,34250,0.15,4300,3.75,34250,0.15,4540,3.75]
[null,34275,0.25,4750,6.25,34275,0.15,4303.75,3.75,34275,0.15,4543.75,3.75]
[null,34300,0.25,4756.25,6.25,34300,0.15,4307.5,3.75,34300,0.15,4547.5,3.75]
[null,34325,0.25,4762.5,6.25,34325,0.15,4311.25,3.75,34325,0.15,4551.25,3.75]
[null,34350,0.25,4768.75,6.25,34350,0.15,4315,3.75,34350,0.15,4555,3.75]
[null,34375,0.25,4775,6.25,34375,0.15,{"$f":"+(F1384-16750)*G1384+$H$679","v":4318.75},3.75,34375,0.15,{"$f":"+(J1384-11950)*K1384+$L$487","v":4558.75},3.75]
[null,34400,0.25,4781.25,6.25,34400,0.15,4322.5,3.75,34400,0.15,4562.5,3.75]
[null,34425,0.25,4787.5,6.25,34425,0.15,4326.25,3.75,34425,0.15,4566.25,3.75]
[null,34450,0.25,4793.75,6.25,34450,0.15,4330,3.75,34450,0.15,4570,3.75]
[null,34475,0.25,4800,6.25,34475,0.15,4333.75,3.75,34475,0.15,4573.75,3.75]
[null,34500,0.25,4806.25,6.25,34500,0.15,4337.5,3.75,34500,0.15,4577.5,3.75]
[null,34525,0.25,4812.5,6.25,34525,0.15,4341.25,3.75,34525,0.15,4581.25,3.75]
[null,34550,0.25,4818.75,6.25,34550,0.15,4345,3.75,34550,0.15,4585,3.75]
[null,34575,0.25,4825,6.25,34575,0.15,4348.75,3.75,34575,0.15,4588.75,3.75]
[null,34600,0.25,4831.25,6.25,34600,0.15,4352.5,3.75,34600,0.15,4592.5,3.75]
[null,34625,0.25,4837.5,6.25,34625,0.15,4356.25,3.75,34625,0.15,4596.25,3.75]
[null,34650,0.25,4843.75,6.25,34650,0.15,4360,3.75,34650,0.15,4600,3.75]
[null,34675,0.25,4850,6.25,34675,0.15,4363.75,3.75,34675,0.15,4603.75,3.75]
[null,34700,0.25,4856.25,{"$f":"+D1397-D1396","v":6.25},34700,0.15,4367.5,3.75,34700,0.15,4607.5,3.75]
[null,34725,0.25,4862.5,6.25,34725,0.15,4371.25,3.75,34725,0.15,4611.25,3.75]
[null,34750,0.25,4868.75,6.25,34750,0.15,4375,3.75,34750,0.15,4615,3.75]
[null,34775,0.25,4875,6.25,34775,0.15,4378.75,3.75,34775,0.15,4618.75,3.75]
[null,34800,0.25,4881.25,6.25,34800,0.15,4382.5,3.75,34800,0.15,4622.5,3.75]
[null,34825,0.25,4887.5,6.25,34825,0.15,4386.25,3.75,34825,0.15,4626.25,3.75]
[null,34850,0.25,4893.75,6.25,34850,0.15,4390,3.75,34850,0.15,4630,3.75]
[null,34875,0.25,4900,6.25,34875,0.15,4393.75,3.75,34875,0.15,4633.75,3.75]
[null,34900,0.25,4906.25,6.25,34900,0.15,4397.5,3.75,34900,0.15,4637.5,3.75]
[null,34925,0.25,4912.5,6.25,34925,0.15,4401.25,3.75,34925,0.15,4641.25,3.75]
[null,34950,0.25,4918.75,6.25,34950,0.15,4405,3.75,34950,0.15,4645,3.75]
[null,34975,0.25,4925,6.25,34975,0.15,4408.75,3.75,34975,0.15,4648.75,3.75]
[null,35000,0.25,4931.25,6.25,35000,0.15,4412.5,3.75,35000,0.15,4652.5,3.75]
[null,35025,0.25,4937.5,6.25,35025,0.15,4416.25,3.75,35025,0.15,4656.25,3.75]
[null,35050,0.25,4943.75,6.25,35050,0.15,4420,3.75,35050,0.15,4660,3.75]
[null,35075,0.25,4950,6.25,35075,0.15,4423.75,3.75,35075,0.15,4663.75,3.75]
[null,35100,0.25,4956.25,6.25,35100,0.15,4427.5,3.75,35100,0.15,4667.5,3.75]
[null,35125,0.25,4962.5,6.25,35125,0.15,4431.25,3.75,35125,0.15,4671.25,3.75]
[null,35150,0.25,4968.75,6.25,35150,0.15,4435,3.75,35150,0.15,4675,3.75]
[null,35175,0.25,4975,6.25,35175,0.15,4438.75,3.75,35175,0.15,4678.75,3.75]
[null,35200,0.25,4981.25,6.25,35200,0.15,4442.5,3.75,35200,0.15,4682.5,3.75]
[null,35225,0.25,4987.5,6.25,35225,0.15,4446.25,{"$f":"+H1418-H1417","v":3.75},35225,0.15,4686.25,{"$f":"+L1418-L1417","v":3.75}]
[null,35250,0.25,4993.75,6.25,35250,0.15,4450,3.75,35250,0.15,4690,3.75]
[null,35275,0.25,5000,6.25,35275,0.15,4453.75,3.75,35275,0.15,4693.75,3.75]
[null,35300,0.25,5006.25,6.25,35300,0.15,4457.5,3.75,35300,0.15,4697.5,3.75]
[null,35325,0.25,5012.5,6.25,35325,0.15,4461.25,3.75,35325,0.15,4701.25,3.75]
[null,35350,0.25,5018.75,6.25,35350,0.15,4465,3.75,35350,0.15,4705,3.75]
[null,35375,0.25,5025,6.25,35375,0.15,4468.75,3.75,35375,0.15,4708.75,3.75]
[null,35400,0.25,5031.25,6.25,35400,0.15,4472.5,3.75,35400,0.15,4712.5,3.75]
[null,35425,0.25,5037.5,6.25,35425,0.15,4476.25,3.75,35425,0.15,4716.25,3.75]
[null,35450,0.25,5043.75,6.25,35450,0.15,4480,3.75,35450,0.15,4720,3.75]
[null,35475,0.25,5050,6.25,35475,0.15,4483.75,3.75,35475,0.15,4723.75,3.75]
[null,35500,0.25,5056.25,6.25,35500,0.15,4487.5,3.75,35500,0.15,4727.5,3.75]
[null,35525,0.25,5062.5,6.25,35525,0.15,4491.25,3.75,35525,0.15,4731.25,3.75]
[null,35550,0.25,5068.75,6.25,35550,0.15,4495,3.75,35550,0.15,4735,3.75]
[null,35575,0.25,5075,6.25,35575,0.15,4498.75,3.75,35575,0.15,4738.75,3.75]
[null,35600,0.25,5081.25,6.25,35600,0.15,4502.5,3.75,35600,0.15,4742.5,3.75]
[null,35625,0.25,{"$f":"+(B1434-34000)*C1434+$D$1369","v":5087.5},6.25,35625,0.15,4506.25,3.75,35625,0.15,4746.25,3.75]
[null,35650,0.25,5093.75,6.25,35650,0.15,4510,3.75,35650,0.15,4750,3.75]
[null,35675,0.25,5100,6.25,35675,0.15,4513.75,3.75,35675,0.15,4753.75,3.75]
[null,35700,0.25,5106.25,6.25,35700,0.15,4517.5,3.75,35700,0.15,4757.5,3.75]
[null,35725,0.25,5112.5,6.25,35725,0.15,4521.25,3.75,35725,0.15,4761.25,3.75]
[null,35750,0.25,5118.75,6.25,35750,0.15,4525,3.75,35750,0.15,4765,3.75]
[null,35775,0.25,5125,6.25,35775,0.15,4528.75,3.75,35775,0.15,4768.75,3.75]
[null,35800,0.25,5131.25,6.25,35800,0.15,4532.5,3.75,35800,0.15,4772.5,3.75]
[null,35825,0.25,5137.5,6.25,35825,0.15,4536.25,3.75,35825,0.15,4776.25,3.75]
[null,35850,0.25,5143.75,6.25,35850,0.15,4540,3.75,35850,0.15,4780,3.75]
[null,35875,0.25,5150,6.25,35875,0.15,4543.75,3.75,35875,0.15,4783.75,3.75]
[null,35900,0.25,5156.25,6.25,35900,0.15,4547.5,3.75,35900,0.15,4787.5,3.75]
[null,35925,0.25,5162.5,6.25,35925,0.15,4551.25,3.75,35925,0.15,4791.25,3.75]
[null,35950,0.25,5168.75,6.25,35950,0.15,4555,3.75,35950,0.15,4795,3.75]
[null,35975,0.25,5175,6.25,35975,0.15,{"$f":"+(F1448-16750)*G1448+$H$679","v":4558.75},3.75,35975,0.15,{"$f":"+(J1448-11950)*K1448+$L$487","v":4798.75},3.75]
[null,36000,0.25,5181.25,6.25,36000,0.15,4562.5,3.75,36000,0.15,4802.5,3.75]
[null,36025,0.25,5187.5,6.25,36025,0.15,4566.25,3.75,36025,0.15,4806.25,3.75]
[null,36050,0.25,5193.75,6.25,36050,0.15,4570,3.75,36050,0.15,4810,3.75]
[null,36075,0.25,5200,6.25,36075,0.15,4573.75,3.75,36075,0.15,4813.75,3.75]
[null,36100,0.25,5206.25,6.25,36100,0.15,4577.5,3.75,36100,0.15,4817.5,3.75]
[null,36125,0.25,5212.5,6.25,36125,0.15,4581.25,3.75,36125,0.15,4821.25,3.75]
[null,36150,0.25,5218.75,6.25,36150,0.15,4585,3.75,36150,0.15,4825,3.75]
[null,36175,0.25,5225,6.25,36175,0.15,4588.75,3.75,36175,0.15,4828.75,3.75]
[null,36200,0.25,5231.25,6.25,36200,0.15,4592.5,3.75,36200,0.15,4832.5,3.75]
[null,36225,0.25,5237.5,6.25,36225,0.15,4596.25,3.75,36225,0.15,4836.25,3.75]
[null,36250,0.25,5243.75,6.25,36250,0.15,4600,3.75,36250,0.15,4840,3.75]
[null,36275,0.25,5250,6.25,36275,0.15,4603.75,3.75,36275,0.15,4843.75,3.75]
[null,36300,0.25,5256.25,{"$f":"+D1461-D1460","v":6.25},36300,0.15,4607.5,3.75,36300,0.15,4847.5,3.75]
[null,36325,0.25,5262.5,6.25,36325,0.15,4611.25,3.75,36325,0.15,4851.25,3.75]
[null,36350,0.25,5268.75,6.25,36350,0.15,4615,3.75,36350,0.15,4855,3.75]
[null,36375,0.25,5275,6.25,36375,0.15,4618.75,3.75,36375,0.15,4858.75,3.75]
[null,36400,0.25,5281.25,6.25,36400,0.15,4622.5,3.75,36400,0.15,4862.5,3.75]
[null,36425,0.25,5287.5,6.25,36425,0.15,4626.25,3.75,36425,0.15,4866.25,3.75]
[null,36450,0.25,5293.75,6.25,36450,0.15,4630,3.75,36450,0.15,4870,3.75]
[null,36475,0.25,5300,6.25,36475,0.15,4633.75,3.75,36475,0.15,4873.75,3.75]
[null,36500,0.25,5306.25,6.25,36500,0.15,4637.5,3.75,36500,0.15,4877.5,3.75]
[null,36525,0.25,5312.5,6.25,36525,0.15,4641.25,3.75,36525,0.15,4881.25,3.75]
[null,36550,0.25,5318.75,6.25,36550,0.15,4645,3.75,36550,0.15,4885,3.75]
[null,36575,0.25,5325,6.25,36575,0.15,4648.75,3.75,36575,0.15,4888.75,3.75]
[null,36600,0.25,5331.25,6.25,36600,0.15,4652.5,3.75,36600,0.15,4892.5,3.75]
[null,36625,0.25,5337.5,6.25,36625,0.15,4656.25,3.75,36625,0.15,4896.25,3.75]
[null,36650,0.25,5343.75,6.25,36650,0.15,4660,3.75,36650,0.15,4900,3.75]
[null,36675,0.25,5350,6.25,36675,0.15,4663.75,3.75,36675,0.15,4903.75,3.75]
[null,36700,0.25,5356.25,6.25,36700,0.15,4667.5,3.75,36700,0.15,4907.5,3.75]
[null,36725,0.25,5362.5,6.25,36725,0.15,4671.25,3.75,36725,0.15,4911.25,3.75]
[null,36750,0.25,5368.75,6.25,36750,0.15,4675,3.75,36750,0.15,4915,3.75]
[null,36775,0.25,5375,6.25,36775,0.15,4678.75,3.75,36775,0.15,4918.75,3.75]
[null,36800,0.25,5381.25,6.25,36800,0.15,4682.5,3.75,36800,0.15,4922.5,3.75]
[null,36825,0.25,5387.5,6.25,36825,0.15,4686.25,{"$f":"+H1482-H1481","v":3.75},36825,0.15,4926.25,{"$f":"+L1482-L1481","v":3.75}]
[null,36850,0.25,5393.75,6.25,36850,0.15,4690,3.75,36850,0.15,4930,3.75]
[null,36875,0.25,5400,6.25,36875,0.15,4693.75,3.75,36875,0.15,4933.75,3.75]
[null,36900,0.25,5406.25,6.25,36900,0.15,4697.5,3.75,36900,0.15,4937.5,3.75]
[null,36925,0.25,5412.5,6.25,36925,0.15,4701.25,3.75,36925,0.15,4941.25,3.75]
[null,36950,0.25,5418.75,6.25,36950,0.15,4705,3.75,36950,0.15,4945,3.75]
[null,36975,0.25,5425,6.25,36975,0.15,4708.75,3.75,36975,0.15,4948.75,3.75]
[null,37000,0.25,5431.25,6.25,37000,0.15,4712.5,3.75,37000,0.15,4952.5,3.75]
[null,37025,0.25,5437.5,6.25,37025,0.15,4716.25,3.75,37025,0.15,4956.25,3.75]
[null,37050,0.25,5443.75,6.25,37050,0.15,4720,3.75,37050,0.15,4960,3.75]
[null,37075,0.25,5450,6.25,37075,0.15,4723.75,3.75,37075,0.15,4963.75,3.75]
[null,37100,0.25,5456.25,6.25,37100,0.15,4727.5,3.75,37100,0.15,4967.5,3.75]
[null,37125,0.25,5462.5,6.25,37125,0.15,4731.25,3.75,37125,0.15,4971.25,3.75]
[null,37150,0.25,5468.75,6.25,37150,0.15,4735,3.75,37150,0.15,4975,3.75]
[null,37175,0.25,5475,6.25,37175,0.15,4738.75,3.75,37175,0.15,4978.75,3.75]
[null,37200,0.25,5481.25,6.25,37200,0.15,4742.5,3.75,37200,0.15,4982.5,3.75]
[null,37225,0.25,{"$f":"+(B1498-34000)*C1498+$D$1369","v":5487.5},6.25,37225,0.15,4746.25,3.75,37225,0.15,4986.25,3.75]
[null,37250,0.25,5493.75,6.25,37250,0.15,4750,3.75,37250,0.15,4990,3.75]
[null,37275,0.25,5500,6.25,37275,0.15,4753.75,3.75,37275,0.15,4993.75,3.75]
[null,37300,0.25,5506.25,6.25,37300,0.15,4757.5,3.75,37300,0.15,4997.5,3.75]
[null,37325,0.25,5512.5,6.25,37325,0.15,4761.25,3.75,37325,0.15,5001.25,3.75]
[null,37350,0.25,5518.75,6.25,37350,0.15,4765,3.75,37350,0.15,5005,3.75]
[null,37375,0.25,5525,6.25,37375,0.15,4768.75,3.75,37375,0.15,5008.75,3.75]
[null,37400,0.25,5531.25,6.25,37400,0.15,4772.5,3.75,37400,0.15,5012.5,3.75]
[null,37425,0.25,5537.5,6.25,37425,0.15,4776.25,3.75,37425,0.15,5016.25,3.75]
[null,37450,0.25,5543.75,6.25,37450,0.15,4780,3.75,37450,0.15,5020,3.75]
[null,37475,0.25,5550,6.25,37475,0.15,4783.75,3.75,37475,0.15,5023.75,3.75]
[null,37500,0.25,5556.25,6.25,37500,0.15,4787.5,3.75,37500,0.15,5027.5,3.75]
[null,37525,0.25,5562.5,6.25,37525,0.15,4791.25,3.75,37525,0.15,5031.25,3.75]
[null,37550,0.25,5568.75,6.25,37550,0.15,4795,3.75,37550,0.15,5035,3.75]
[null,37575,0.25,5575,6.25,37575,0.15,{"$f":"+(F1512-16750)*G1512+$H$679","v":4798.75},3.75,37575,0.15,{"$f":"+(J1512-11950)*K1512+$L$487","v":5038.75},3.75]
[null,37600,0.25,5581.25,6.25,37600,0.15,4802.5,3.75,37600,0.15,5042.5,3.75]
[null,37625,0.25,5587.5,6.25,37625,0.15,4806.25,3.75,37625,0.15,5046.25,3.75]
[null,37650,0.25,5593.75,6.25,37650,0.15,4810,3.75,37650,0.15,5050,3.75]
[null,37675,0.25,5600,6.25,37675,0.15,4813.75,3.75,37675,0.15,5053.75,3.75]
[null,37700,0.25,5606.25,6.25,37700,0.15,4817.5,3.75,37700,0.15,5057.5,3.75]
[null,37725,0.25,5612.5,6.25,37725,0.15,4821.25,3.75,37725,0.15,5061.25,3.75]
[null,37750,0.25,5618.75,6.25,37750,0.15,4825,3.75,37750,0.15,5065,3.75]
[null,37775,0.25,5625,6.25,37775,0.15,4828.75,3.75,37775,0.15,5068.75,3.75]
[null,37800,0.25,5631.25,6.25,37800,0.15,4832.5,3.75,37800,0.15,5072.5,3.75]
[null,37825,0.25,5637.5,6.25,37825,0.15,4836.25,3.75,37825,0.15,5076.25,3.75]
[null,37850,0.25,5643.75,6.25,37850,0.15,4840,3.75,37850,0.15,5080,3.75]
[null,37875,0.25,5650,6.25,37875,0.15,4843.75,3.75,37875,0.15,5083.75,3.75]
[null,37900,0.25,5656.25,{"$f":"+D1525-D1524","v":6.25},37900,0.15,4847.5,3.75,37900,0.15,5087.5,3.75]
[null,37925,0.25,5662.5,6.25,37925,0.15,4851.25,3.75,37925,0.15,5091.25,3.75]
[null,37950,0.25,5668.75,6.25,37950,0.15,4855,3.75,37950,0.15,5095,3.75]
[null,37975,0.25,5675,6.25,37975,0.15,4858.75,3.75,37975,0.15,5098.75,3.75]
[null,38000,0.25,5681.25,6.25,38000,0.15,4862.5,3.75,38000,0.15,5102.5,3.75]
[null,38025,0.25,5687.5,6.25,38025,0.15,4866.25,3.75,38025,0.15,5106.25,3.75]
[null,38050,0.25,5693.75,6.25,38050,0.15,4870,3.75,38050,0.15,5110,3.75]
[null,38075,0.25,5700,6.25,38075,0.15,4873.75,3.75,38075,0.15,5113.75,3.75]
[null,38100,0.25,5706.25,6.25,38100,0.15,4877.5,3.75,38100,0.15,5117.5,3.75]
[null,38125,0.25,5712.5,6.25,38125,0.15,4881.25,3.75,38125,0.15,5121.25,3.75]
[null,38150,0.25,5718.75,6.25,38150,0.15,4885,3.75,38150,0.15,5125,3.75]
[null,38175,0.25,5725,6.25,38175,0.15,4888.75,3.75,38175,0.15,5128.75,3.75]
[null,38200,0.25,5731.25,6.25,38200,0.15,4892.5,3.75,38200,0.15,5132.5,3.75]
[null,38225,0.25,5737.5,6.25,38225,0.15,4896.25,3.75,38225,0.15,5136.25,3.75]
[null,38250,0.25,5743.75,6.25,38250,0.15,4900,3.75,38250,0.15,5140,3.75]
[null,38275,0.25,5750,6.25,38275,0.15,4903.75,3.75,38275,0.15,5143.75,3.75]
[null,38300,0.25,5756.25,6.25,38300,0.15,4907.5,3.75,38300,0.15,5147.5,3.75]
[null,38325,0.25,5762.5,6.25,38325,0.15,4911.25,3.75,38325,0.15,5151.25,3.75]
[null,38350,0.25,5768.75,6.25,38350,0.15,4915,3.75,38350,0.15,5155,3.75]
[null,38375,0.25,5775,6.25,38375,0.15,4918.75,3.75,38375,0.15,5158.75,3.75]
[null,38400,0.25,5781.25,6.25,38400,0.15,4922.5,3.75,38400,0.15,5162.5,3.75]
[null,38425,0.25,5787.5,6.25,38425,0.15,4926.25,{"$f":"+H1546-H1545","v":3.75},38425,0.15,5166.25,{"$f":"+L1546-L1545","v":3.75}]
[null,38450,0.25,5793.75,6.25,38450,0.15,4930,3.75,38450,0.15,5170,3.75]
[null,38475,0.25,5800,6.25,38475,0.15,4933.75,3.75,38475,0.15,5173.75,3.75]
[null,38500,0.25,5806.25,6.25,38500,0.15,4937.5,3.75,38500,0.15,5177.5,3.75]
[null,38525,0.25,5812.5,6.25,38525,0.15,4941.25,3.75,38525,0.15,5181.25,3.75]
[null,38550,0.25,5818.75,6.25,38550,0.15,4945,3.75,38550,0.15,5185,3.75]
[null,38575,0.25,5825,6.25,38575,0.15,4948.75,3.75,38575,0.15,5188.75,3.75]
[null,38600,0.25,5831.25,6.25,38600,0.15,4952.5,3.75,38600,0.15,5192.5,3.75]
[null,38625,0.25,5837.5,6.25,38625,0.15,4956.25,3.75,38625,0.15,5196.25,3.75]
[null,38650,0.25,5843.75,6.25,38650,0.15,4960,3.75,38650,0.15,5200,3.75]
[null,38675,0.25,5850,6.25,38675,0.15,4963.75,3.75,38675,0.15,5203.75,3.75]
[null,38700,0.25,5856.25,6.25,38700,0.15,4967.5,3.75,38700,0.15,5207.5,3.75]
[null,38725,0.25,5862.5,6.25,38725,0.15,4971.25,3.75,38725,0.15,5211.25,3.75]
[null,38750,0.25,5868.75,6.25,38750,0.15,4975,3.75,38750,0.15,5215,3.75]
[null,38775,0.25,5875,6.25,38775,0.15,4978.75,3.75,38775,0.15,5218.75,3.75]
[null,38800,0.25,5881.25,6.25,38800,0.15,4982.5,3.75,38800,0.15,5222.5,3.75]
[null,38825,0.25,{"$f":"+(B1562-34000)*C1562+$D$1369","v":5887.5},6.25,38825,0.15,4986.25,3.75,38825,0.15,5226.25,3.75]
[null,38850,0.25,5893.75,6.25,38850,0.15,4990,3.75,38850,0.15,5230,3.75]
[null,38875,0.25,5900,6.25,38875,0.15,4993.75,3.75,38875,0.15,5233.75,3.75]
[null,38900,0.25,5906.25,6.25,38900,0.15,4997.5,3.75,38900,0.15,5237.5,3.75]
[null,38925,0.25,5912.5,6.25,38925,0.15,5001.25,3.75,38925,0.15,5241.25,3.75]
[null,38950,0.25,5918.75,6.25,38950,0.15,5005,3.75,38950,0.15,5245,3.75]
[null,38975,0.25,5925,6.25,38975,0.15,5008.75,3.75,38975,0.15,5248.75,3.75]
[null,39000,0.25,5931.25,6.25,39000,0.15,5012.5,3.75,39000,0.15,5252.5,3.75]
[null,39025,0.25,5937.5,6.25,39025,0.15,5016.25,3.75,39025,0.15,5256.25,3.75]
[null,39050,0.25,5943.75,6.25,39050,0.15,5020,3.75,39050,0.15,5260,3.75]
[null,39075,0.25,5950,6.25,39075,0.15,5023.75,3.75,39075,0.15,5263.75,3.75]
[null,39100,0.25,5956.25,6.25,39100,0.15,5027.5,3.75,39100,0.15,5267.5,3.75]
[null,39125,0.25,5962.5,6.25,39125,0.15,5031.25,3.75,39125,0.15,5271.25,3.75]
[null,39150,0.25,5968.75,6.25,39150,0.15,5035,3.75,39150,0.15,5275,3.75]
[null,39175,0.25,5975,6.25,39175,0.15,{"$f":"+(F1576-16750)*G1576+$H$679","v":5038.75},3.75,39175,0.15,{"$f":"+(J1576-11950)*K1576+$L$487","v":5278.75},3.75]
[null,39200,0.25,5981.25,6.25,39200,0.15,5042.5,3.75,39200,0.15,5282.5,3.75]
[null,39225,0.25,5987.5,6.25,39225,0.15,5046.25,3.75,39225,0.15,5286.25,3.75]
[null,39250,0.25,5993.75,6.25,39250,0.15,5050,3.75,39250,0.15,5290,3.75]
[null,39275,0.25,6000,6.25,39275,0.15,5053.75,3.75,39275,0.15,5293.75,3.75]
[null,39300,0.25,6006.25,6.25,39300,0.15,5057.5,3.75,39300,0.15,5297.5,3.75]
[null,39325,0.25,6012.5,6.25,39325,0.15,5061.25,3.75,39325,0.15,5301.25,3.75]
[null,39350,0.25,6018.75,6.25,39350,0.15,5065,3.75,39350,0.15,5305,3.75]
[null,39375,0.25,6025,6.25,39375,0.15,5068.75,3.75,39375,0.15,5308.75,3.75]
[null,39400,0.25,6031.25,6.25,39400,0.15,5072.5,3.75,39400,0.15,5312.5,3.75]
[null,39425,0.25,6037.5,6.25,39425,0.15,5076.25,3.75,39425,0.15,5316.25,3.75]
[null,39450,0.25,6043.75,6.25,39450,0.15,5080,3.75,39450,0.15,5320,3.75]
[null,39475,0.25,6050,6.25,39475,0.15,5083.75,3.75,39475,0.15,5323.75,3.75]
[null,39500,0.25,6056.25,{"$f":"+D1589-D1588","v":6.25},39500,0.15,5087.5,3.75,39500,0.15,5327.5,3.75]
[null,39525,0.25,6062.5,6.25,39525,0.15,5091.25,3.75,39525,0.15,5331.25,3.75]
[null,39550,0.25,6068.75,6.25,39550,0.15,5095,3.75,39550,0.15,5335,3.75]
[null,39575,0.25,6075,6.25,39575,0.15,5098.75,3.75,39575,0.15,5338.75,3.75]
[null,39600,0.25,6081.25,6.25,39600,0.15,5102.5,3.75,39600,0.15,5342.5,3.75]
[null,39625,0.25,6087.5,6.25,39625,0.15,5106.25,3.75,39625,0.15,5346.25,3.75]
[null,39650,0.25,6093.75,6.25,39650,0.15,5110,3.75,39650,0.15,5350,3.75]
[null,39675,0.25,6100,6.25,39675,0.15,5113.75,3.75,39675,0.15,5353.75,3.75]
[null,39700,0.25,6106.25,6.25,39700,0.15,5117.5,3.75,39700,0.15,5357.5,3.75]
[null,39725,0.25,6112.5,6.25,39725,0.15,5121.25,3.75,39725,0.15,5361.25,3.75]
[null,39750,0.25,6118.75,6.25,39750,0.15,5125,3.75,39750,0.15,5365,3.75]
[null,39775,0.25,6125,6.25,39775,0.15,5128.75,3.75,39775,0.15,5368.75,3.75]
[null,39800,0.25,6131.25,6.25,39800,0.15,5132.5,3.75,39800,0.15,5372.5,3.75]
[null,39825,0.25,6137.5,6.25,39825,0.15,5136.25,3.75,39825,0.15,5376.25,3.75]
[null,39850,0.25,6143.75,6.25,39850,0.15,5140,3.75,39850,0.15,5380,3.75]
[null,39875,0.25,6150,6.25,39875,0.15,5143.75,3.75,39875,0.15,5383.75,3.75]
[null,39900,0.25,6156.25,6.25,39900,0.15,5147.5,3.75,39900,0.15,5387.5,3.75]
[null,39925,0.25,6162.5,6.25,39925,0.15,5151.25,3.75,39925,0.15,5391.25,3.75]
[null,39950,0.25,6168.75,6.25,39950,0.15,5155,3.75,39950,0.15,5395,3.75]
[null,39975,0.25,6175,6.25,39975,0.15,5158.75,3.75,39975,0.15,5398.75,3.75]
[null,40000,0.25,6181.25,6.25,40000,0.15,5162.5,3.75,40000,0.15,5402.5,3.75]
[null,40025,0.25,6187.5,6.25,40025,0.15,5166.25,{"$f":"+H1610-H1609","v":3.75},40025,0.15,5406.25,{"$f":"+L1610-L1609","v":3.75}]
[null,40050,0.25,6193.75,6.25,40050,0.15,5170,3.75,40050,0.15,5410,3.75]
[null,40075,0.25,6200,6.25,40075,0.15,5173.75,3.75,40075,0.15,5413.75,3.75]
[null,40100,0.25,6206.25,6.25,40100,0.15,5177.5,3.75,40100,0.15,5417.5,3.75]
[null,40125,0.25,6212.5,6.25,40125,0.15,5181.25,3.75,40125,0.15,5421.25,3.75]
[null,40150,0.25,6218.75,6.25,40150,0.15,5185,3.75,40150,0.15,5425,3.75]
[null,40175,0.25,6225,6.25,40175,0.15,5188.75,3.75,40175,0.15,5428.75,3.75]
[null,40200,0.25,6231.25,6.25,40200,0.15,5192.5,3.75,40200,0.15,5432.5,3.75]
[null,40225,0.25,6237.5,6.25,40225,0.15,5196.25,3.75,40225,0.15,5436.25,3.75]
[null,40250,0.25,6243.75,6.25,40250,0.15,5200,3.75,40250,0.15,5440,3.75]
[null,40275,0.25,6250,6.25,40275,0.15,5203.75,3.75,40275,0.15,5443.75,3.75]
[null,40300,0.25,6256.25,6.25,40300,0.15,5207.5,3.75,40300,0.15,5447.5,3.75]
[null,40325,0.25,6262.5,6.25,40325,0.15,5211.25,3.75,40325,0.15,5451.25,3.75]
[null,40350,0.25,6268.75,6.25,40350,0.15,5215,3.75,40350,0.15,5455,3.75]
[null,40375,0.25,6275,6.25,40375,0.15,5218.75,3.75,40375,0.15,5458.75,3.75]
[null,40400,0.25,6281.25,6.25,40400,0.15,5222.5,3.75,40400,0.15,5462.5,3.75]
[null,40425,0.25,{"$f":"+(B1626-34000)*C1626+$D$1369","v":6287.5},6.25,40425,0.15,5226.25,3.75,40425,0.15,5466.25,3.75]
[null,40450,0.25,6293.75,6.25,40450,0.15,5230,3.75,40450,0.15,5470,3.75]
[null,40475,0.25,6300,6.25,40475,0.15,5233.75,3.75,40475,0.15,5473.75,3.75]
[null,40500,0.25,6306.25,6.25,40500,0.15,5237.5,3.75,40500,0.15,5477.5,3.75]
[null,40525,0.25,6312.5,6.25,40525,0.15,5241.25,3.75,40525,0.15,5481.25,3.75]
[null,40550,0.25,6318.75,6.25,40550,0.15,5245,3.75,40550,0.15,5485,3.75]
[null,40575,0.25,6325,6.25,40575,0.15,5248.75,3.75,40575,0.15,5488.75,3.75]
[null,40600,0.25,6331.25,6.25,40600,0.15,5252.5,3.75,40600,0.15,5492.5,3.75]
[null,40625,0.25,6337.5,6.25,40625,0.15,5256.25,3.75,40625,0.15,5496.25,3.75]
[null,40650,0.25,6343.75,6.25,40650,0.15,5260,3.75,40650,0.15,5500,3.75]
[null,40675,0.25,6350,6.25,40675,0.15,5263.75,3.75,40675,0.15,5503.75,3.75]
[null,40700,0.25,6356.25,6.25,40700,0.15,5267.5,3.75,40700,0.15,5507.5,3.75]
[null,40725,0.25,6362.5,6.25,40725,0.15,5271.25,3.75,40725,0.15,5511.25,3.75]
[null,40750,0.25,6368.75,6.25,40750,0.15,5275,3.75,40750,0.15,5515,3.75]
[null,40775,0.25,6375,6.25,40775,0.15,{"$f":"+(F1640-16750)*G1640+$H$679","v":5278.75},3.75,40775,0.15,{"$f":"+(J1640-11950)*K1640+$L$487","v":5518.75},3.75]
[null,40800,0.25,6381.25,6.25,40800,0.15,5282.5,3.75,40800,0.15,5522.5,3.75]
[null,40825,0.25,6387.5,6.25,40825,0.15,5286.25,3.75,40825,0.15,5526.25,3.75]
[null,40850,0.25,6393.75,6.25,40850,0.15,5290,3.75,40850,0.15,5530,3.75]
[null,40875,0.25,6400,6.25,40875,0.15,5293.75,3.75,40875,0.15,5533.75,3.75]
[null,40900,0.25,6406.25,6.25,40900,0.15,5297.5,3.75,40900,0.15,5537.5,3.75]
[null,40925,0.25,6412.5,6.25,40925,0.15,5301.25,3.75,40925,0.15,5541.25,3.75]
[null,40950,0.25,6418.75,6.25,40950,0.15,5305,3.75,40950,0.15,5545,3.75]
[null,40975,0.25,6425,6.25,40975,0.15,5308.75,3.75,40975,0.15,5548.75,3.75]
[null,41000,0.25,6431.25,6.25,41000,0.15,5312.5,3.75,41000,0.15,5552.5,3.75]
[null,41025,0.25,6437.5,6.25,41025,0.15,5316.25,3.75,41025,0.15,5556.25,3.75]
[null,41050,0.25,6443.75,6.25,41050,0.15,5320,3.75,41050,0.15,5560,3.75]
[null,41075,0.25,6450,6.25,41075,0.15,5323.75,3.75,41075,0.15,5563.75,3.75]
[null,41100,0.25,6456.25,{"$f":"+D1653-D1652","v":6.25},41100,0.15,5327.5,3.75,41100,0.15,5567.5,3.75]
[null,41125,0.25,6462.5,6.25,41125,0.15,5331.25,3.75,41125,0.15,5571.25,3.75]
[null,41150,0.25,6468.75,6.25,41150,0.15,5335,3.75,41150,0.15,5575,3.75]
[null,41175,0.25,6475,6.25,41175,0.15,5338.75,3.75,41175,0.15,5578.75,3.75]
[null,41200,0.25,6481.25,6.25,41200,0.15,5342.5,3.75,41200,0.15,5582.5,3.75]
[null,41225,0.25,6487.5,6.25,41225,0.15,5346.25,3.75,41225,0.15,5586.25,3.75]
[null,41250,0.25,6493.75,6.25,41250,0.15,5350,3.75,41250,0.15,5590,3.75]
[null,41275,0.25,6500,6.25,41275,0.15,5353.75,3.75,41275,0.15,5593.75,3.75]
[null,41300,0.25,6506.25,6.25,41300,0.15,5357.5,3.75,41300,0.15,5597.5,3.75]
[null,41325,0.25,6512.5,6.25,41325,0.15,5361.25,3.75,41325,0.15,5601.25,3.75]
[null,41350,0.25,6518.75,6.25,41350,0.15,5365,3.75,41350,0.15,5605,3.75]
[null,41375,0.25,6525,6.25,41375,0.15,5368.75,3.75,41375,0.15,5608.75,3.75]
[null,41400,0.25,6531.25,6.25,41400,0.15,5372.5,3.75,41400,0.15,5612.5,3.75]
[null,41425,0.25,6537.5,6.25,41425,0.15,5376.25,3.75,41425,0.15,5616.25,3.75]
[null,41450,0.25,6543.75,6.25,41450,0.15,5380,3.75,41450,0.15,5620,3.75]
[null,41475,0.25,6550,6.25,41475,0.15,5383.75,3.75,41475,0.15,5623.75,3.75]
[null,41500,0.25,6556.25,6.25,41500,0.15,5387.5,3.75,41500,0.15,5627.5,3.75]
[null,41525,0.25,6562.5,6.25,41525,0.15,5391.25,3.75,41525,0.15,5631.25,3.75]
[null,41550,0.25,6568.75,6.25,41550,0.15,5395,3.75,41550,0.15,5635,3.75]
[null,41575,0.25,6575,6.25,41575,0.15,5398.75,3.75,41575,0.15,5638.75,3.75]
[null,41600,0.25,6581.25,6.25,41600,0.15,5402.5,3.75,41600,0.15,5642.5,3.75]
[null,41625,0.25,6587.5,6.25,41625,0.15,5406.25,{"$f":"+H1674-H1673","v":3.75},41625,0.15,5646.25,{"$f":"+L1674-L1673","v":3.75}]
[null,41650,0.25,6593.75,6.25,41650,0.15,5410,3.75,41650,0.15,5650,3.75]
[null,41675,0.25,6600,6.25,41675,0.15,5413.75,3.75,41675,0.15,5653.75,3.75]
[null,41700,0.25,6606.25,6.25,41700,0.15,5417.5,3.75,41700,0.15,5657.5,3.75]
[null,41725,0.25,6612.5,6.25,41725,0.15,5421.25,3.75,41725,0.15,5661.25,3.75]
[null,41750,0.25,6618.75,6.25,41750,0.15,5425,3.75,41750,0.15,5665,3.75]
[null,41775,0.25,6625,6.25,41775,0.15,5428.75,3.75,41775,0.15,5668.75,3.75]
[null,41800,0.25,6631.25,6.25,41800,0.15,5432.5,3.75,41800,0.15,5672.5,3.75]
[null,41825,0.25,6637.5,6.25,41825,0.15,5436.25,3.75,41825,0.15,5676.25,3.75]
[null,41850,0.25,6643.75,6.25,41850,0.15,5440,3.75,41850,0.15,5680,3.75]
[null,41875,0.25,6650,6.25,41875,0.15,5443.75,3.75,41875,0.15,5683.75,3.75]
[null,41900,0.25,6656.25,6.25,41900,0.15,5447.5,3.75,41900,0.15,5687.5,3.75]
[null,41925,0.25,6662.5,6.25,41925,0.15,5451.25,3.75,41925,0.15,5691.25,3.75]
[null,41950,0.25,6668.75,6.25,41950,0.15,5455,3.75,41950,0.15,5695,3.75]
[null,41975,0.25,6675,6.25,41975,0.15,5458.75,3.75,41975,0.15,5698.75,3.75]
[null,42000,0.25,6681.25,6.25,42000,0.15,5462.5,3.75,42000,0.15,5702.5,3.75]
[null,42025,0.25,{"$f":"+(B1690-34000)*C1690+$D$1369","v":6687.5},6.25,42025,0.15,5466.25,3.75,42025,0.15,5706.25,3.75]
[null,42050,0.25,6693.75,6.25,42050,0.15,5470,3.75,42050,0.15,5710,3.75]
[null,42075,0.25,6700,6.25,42075,0.15,5473.75,3.75,42075,0.15,5713.75,3.75]
[null,42100,0.25,6706.25,6.25,42100,0.15,5477.5,3.75,42100,0.15,5717.5,3.75]
[null,42125,0.25,6712.5,6.25,42125,0.15,5481.25,3.75,42125,0.15,5721.25,3.75]
[null,42150,0.25,6718.75,6.25,42150,0.15,5485,3.75,42150,0.15,5725,3.75]
[null,42175,0.25,6725,6.25,42175,0.15,5488.75,3.75,42175,0.15,5728.75,3.75]
[null,42200,0.25,6731.25,6.25,42200,0.15,5492.5,3.75,42200,0.15,5732.5,3.75]
[null,42225,0.25,6737.5,6.25,42225,0.15,5496.25,3.75,42225,0.15,5736.25,3.75]
[null,42250,0.25,6743.75,6.25,42250,0.15,5500,3.75,42250,0.15,5740,3.75]
[null,42275,0.25,6750,6.25,42275,0.15,5503.75,3.75,42275,0.15,5743.75,3.75]
[null,42300,0.25,6756.25,6.25,42300,0.15,5507.5,3.75,42300,0.15,5747.5,3.75]
[null,42325,0.25,6762.5,6.25,42325,0.15,5511.25,3.75,42325,0.15,5751.25,3.75]
[null,42350,0.25,6768.75,6.25,42350,0.15,5515,3.75,42350,0.15,5755,3.75]
[null,42375,0.25,6775,6.25,42375,0.15,{"$f":"+(F1704-16750)*G1704+$H$679","v":5518.75},3.75,42375,0.15,{"$f":"+(J1704-11950)*K1704+$L$487","v":5758.75},3.75]
[null,42400,0.25,6781.25,6.25,42400,0.15,5522.5,3.75,42400,0.15,5762.5,3.75]
[null,42425,0.25,6787.5,6.25,42425,0.15,5526.25,3.75,42425,0.15,5766.25,3.75]
[null,42450,0.25,6793.75,6.25,42450,0.15,5530,3.75,42450,0.15,5770,3.75]
[null,42475,0.25,6800,6.25,42475,0.15,5533.75,3.75,42475,0.15,5773.75,3.75]
[null,42500,0.25,6806.25,6.25,42500,0.15,5537.5,3.75,42500,0.15,5777.5,3.75]
[null,42525,0.25,6812.5,6.25,42525,0.15,5541.25,3.75,42525,0.15,5781.25,3.75]
[null,42550,0.25,6818.75,6.25,42550,0.15,5545,3.75,42550,0.15,5785,3.75]
[null,42575,0.25,6825,6.25,42575,0.15,5548.75,3.75,42575,0.15,5788.75,3.75]
[null,42600,0.25,6831.25,6.25,42600,0.15,5552.5,3.75,42600,0.15,5792.5,3.75]
[null,42625,0.25,6837.5,6.25,42625,0.15,5556.25,3.75,42625,0.15,5796.25,3.75]
[null,42650,0.25,6843.75,6.25,42650,0.15,5560,3.75,42650,0.15,5800,3.75]
[null,42675,0.25,6850,6.25,42675,0.15,5563.75,3.75,42675,0.15,5803.75,3.75]
[null,42700,0.25,6856.25,{"$f":"+D1717-D1716","v":6.25},42700,0.15,5567.5,3.75,42700,0.15,5807.5,3.75]
[null,42725,0.25,6862.5,6.25,42725,0.15,5571.25,3.75,42725,0.15,5811.25,3.75]
[null,42750,0.25,6868.75,6.25,42750,0.15,5575,3.75,42750,0.15,5815,3.75]
[null,42775,0.25,6875,6.25,42775,0.15,5578.75,3.75,42775,0.15,5818.75,3.75]
[null,42800,0.25,6881.25,6.25,42800,0.15,5582.5,3.75,42800,0.15,5822.5,3.75]
[null,42825,0.25,6887.5,6.25,42825,0.15,5586.25,3.75,42825,0.15,5826.25,3.75]
[null,42850,0.25,6893.75,6.25,42850,0.15,5590,3.75,42850,0.15,5830,3.75]
[null,42875,0.25,6900,6.25,42875,0.15,5593.75,3.75,42875,0.15,5833.75,3.75]
[null,42900,0.25,6906.25,6.25,42900,0.15,5597.5,3.75,42900,0.15,5837.5,3.75]
[null,42925,0.25,6912.5,6.25,42925,0.15,5601.25,3.75,42925,0.15,5841.25,3.75]
[null,42950,0.25,6918.75,6.25,42950,0.15,5605,3.75,42950,0.15,5845,3.75]
[null,42975,0.25,6925,6.25,42975,0.15,5608.75,3.75,42975,0.15,5848.75,3.75]
[null,43000,0.25,6931.25,6.25,43000,0.15,5612.5,3.75,43000,0.15,5852.5,3.75]
[null,43025,0.25,6937.5,6.25,43025,0.15,5616.25,3.75,43025,0.15,5856.25,3.75]
[null,43050,0.25,6943.75,6.25,43050,0.15,5620,3.75,43050,0.15,5860,3.75]
[null,43075,0.25,6950,6.25,43075,0.15,5623.75,3.75,43075,0.15,5863.75,3.75]
[null,43100,0.25,6956.25,6.25,43100,0.15,5627.5,3.75,43100,0.15,5867.5,3.75]
[null,43125,0.25,6962.5,6.25,43125,0.15,5631.25,3.75,43125,0.15,5871.25,3.75]
[null,43150,0.25,6968.75,6.25,43150,0.15,5635,3.75,43150,0.15,5875,3.75]
[null,43175,0.25,6975,6.25,43175,0.15,5638.75,3.75,43175,0.15,5878.75,3.75]
[null,43200,0.25,6981.25,6.25,43200,0.15,5642.5,3.75,43200,0.15,5882.5,3.75]
[null,43225,0.25,6987.5,6.25,43225,0.15,5646.25,{"$f":"+H1738-H1737","v":3.75},43225,0.15,5886.25,{"$f":"+L1738-L1737","v":3.75}]
[null,43250,0.25,6993.75,6.25,43250,0.15,5650,3.75,43250,0.15,5890,3.75]
[null,43275,0.25,7000,6.25,43275,0.15,5653.75,3.75,43275,0.15,5893.75,3.75]
[null,43300,0.25,7006.25,6.25,43300,0.15,5657.5,3.75,43300,0.15,5897.5,3.75]
[null,43325,0.25,7012.5,6.25,43325,0.15,5661.25,3.75,43325,0.15,5901.25,3.75]
[null,43350,0.25,7018.75,6.25,43350,0.15,5665,3.75,43350,0.15,5905,3.75]
[null,43375,0.25,7025,6.25,43375,0.15,5668.75,3.75,43375,0.15,5908.75,3.75]
[null,43400,0.25,7031.25,6.25,43400,0.15,5672.5,3.75,43400,0.15,5912.5,3.75]
[null,43425,0.25,7037.5,6.25,43425,0.15,5676.25,3.75,43425,0.15,5916.25,3.75]
[null,43450,0.25,7043.75,6.25,43450,0.15,5680,3.75,43450,0.15,5920,3.75]
[null,43475,0.25,7050,6.25,43475,0.15,5683.75,3.75,43475,0.15,5923.75,3.75]
[null,43500,0.25,7056.25,6.25,43500,0.15,5687.5,3.75,43500,0.15,5927.5,3.75]
[null,43525,0.25,7062.5,6.25,43525,0.15,5691.25,3.75,43525,0.15,5931.25,3.75]
[null,43550,0.25,7068.75,6.25,43550,0.15,5695,3.75,43550,0.15,5935,3.75]
[null,43575,0.25,7075,6.25,43575,0.15,5698.75,3.75,43575,0.15,5938.75,3.75]
[null,43600,0.25,7081.25,6.25,43600,0.15,5702.5,3.75,43600,0.15,5942.5,3.75]
[null,43625,0.25,{"$f":"+(B1754-34000)*C1754+$D$1369","v":7087.5},6.25,43625,0.15,5706.25,3.75,43625,0.15,5946.25,3.75]
[null,43650,0.25,7093.75,6.25,43650,0.15,5710,3.75,43650,0.15,5950,3.75]
[null,43675,0.25,7100,6.25,43675,0.15,5713.75,3.75,43675,0.15,5953.75,3.75]
[null,43700,0.25,7106.25,6.25,43700,0.15,5717.5,3.75,43700,0.15,5957.5,3.75]
[null,43725,0.25,7112.5,6.25,43725,0.15,5721.25,3.75,43725,0.15,5961.25,3.75]
[null,43750,0.25,7118.75,6.25,43750,0.15,5725,3.75,43750,0.15,5965,3.75]
[null,43775,0.25,7125,6.25,43775,0.15,5728.75,3.75,43775,0.15,5968.75,3.75]
[null,43800,0.25,7131.25,6.25,43800,0.15,5732.5,3.75,43800,0.15,5972.5,3.75]
[null,43825,0.25,7137.5,6.25,43825,0.15,5736.25,3.75,43825,0.15,5976.25,3.75]
[null,43850,0.25,7143.75,6.25,43850,0.15,5740,3.75,43850,0.15,5980,3.75]
[null,43875,0.25,7150,6.25,43875,0.15,5743.75,3.75,43875,0.15,5983.75,3.75]
[null,43900,0.25,7156.25,6.25,43900,0.15,5747.5,3.75,43900,0.15,5987.5,3.75]
[null,43925,0.25,7162.5,6.25,43925,0.15,5751.25,3.75,43925,0.15,5991.25,3.75]
[null,43950,0.25,7168.75,6.25,43950,0.15,5755,3.75,43950,0.15,5995,3.75]
[null,43975,0.25,7175,6.25,43975,0.15,{"$f":"+(F1768-16750)*G1768+$H$679","v":5758.75},3.75,43975,0.15,{"$f":"+(J1768-11950)*K1768+$L$487","v":5998.75},3.75]
[null,44000,0.25,7181.25,6.25,44000,0.15,5762.5,3.75,44000,0.15,6002.5,3.75]
[null,44025,0.25,7187.5,6.25,44025,0.15,5766.25,3.75,44025,0.15,6006.25,3.75]
[null,44050,0.25,7193.75,6.25,44050,0.15,5770,3.75,44050,0.15,6010,3.75]
[null,44075,0.25,7200,6.25,44075,0.15,5773.75,3.75,44075,0.15,6013.75,3.75]
[null,44100,0.25,7206.25,6.25,44100,0.15,5777.5,3.75,44100,0.15,6017.5,3.75]
[null,44125,0.25,7212.5,6.25,44125,0.15,5781.25,3.75,44125,0.15,6021.25,3.75]
[null,44150,0.25,7218.75,6.25,44150,0.15,5785,3.75,44150,0.15,6025,3.75]
[null,44175,0.25,7225,6.25,44175,0.15,5788.75,3.75,44175,0.15,6028.75,3.75]
[null,44200,0.25,7231.25,6.25,44200,0.15,5792.5,3.75,44200,0.15,6032.5,3.75]
[null,44225,0.25,7237.5,6.25,44225,0.15,5796.25,3.75,44225,0.15,6036.25,3.75]
[null,44250,0.25,7243.75,6.25,44250,0.15,5800,3.75,44250,0.15,6040,3.75]
[null,44275,0.25,7250,6.25,44275,0.15,5803.75,3.75,44275,0.15,6043.75,3.75]
[null,44300,0.25,7256.25,{"$f":"+D1781-D1780","v":6.25},44300,0.15,5807.5,3.75,44300,0.15,6047.5,3.75]
[null,44325,0.25,7262.5,6.25,44325,0.15,5811.25,3.75,44325,0.15,6051.25,3.75]
[null,44350,0.25,7268.75,6.25,44350,0.15,5815,3.75,44350,0.15,6055,3.75]
[null,44375,0.25,7275,6.25,44375,0.15,5818.75,3.75,44375,0.15,6058.75,3.75]
[null,44400,0.25,7281.25,6.25,44400,0.15,5822.5,3.75,44400,0.15,6062.5,3.75]
[null,44425,0.25,7287.5,6.25,44425,0.15,5826.25,3.75,44425,0.15,6066.25,3.75]
[null,44450,0.25,7293.75,6.25,44450,0.15,5830,3.75,44450,0.15,6070,3.75]
[null,44475,0.25,7300,6.25,44475,0.15,5833.75,3.75,44475,0.15,6073.75,3.75]
[null,44500,0.25,7306.25,6.25,44500,0.15,5837.5,3.75,44500,0.15,6077.5,3.75]
[null,44525,0.25,7312.5,6.25,44525,0.15,5841.25,3.75,44525,0.15,6081.25,3.75]
[null,44550,0.25,7318.75,6.25,44550,0.15,5845,3.75,44550,0.15,6085,3.75]
[null,44575,0.25,7325,6.25,44575,0.15,5848.75,3.75,44575,0.15,6088.75,3.75]
[null,44600,0.25,7331.25,6.25,44600,0.15,5852.5,3.75,44600,0.15,6092.5,3.75]
[null,44625,0.25,7337.5,6.25,44625,0.15,5856.25,3.75,44625,0.15,6096.25,3.75]
[null,44650,0.25,7343.75,6.25,44650,0.15,5860,3.75,44650,0.15,6100,3.75]
[null,44675,0.25,7350,6.25,44675,0.15,5863.75,3.75,44675,0.15,6103.75,3.75]
[null,44700,0.25,7356.25,6.25,44700,0.15,5867.5,3.75,44700,0.15,6107.5,3.75]
[null,44725,0.25,7362.5,6.25,44725,0.15,5871.25,3.75,44725,0.15,6111.25,3.75]
[null,44750,0.25,7368.75,6.25,44750,0.15,5875,3.75,44750,0.15,6115,3.75]
[null,44775,0.25,7375,6.25,44775,0.15,5878.75,3.75,44775,0.15,6118.75,3.75]
[null,44800,0.25,7381.25,6.25,44800,0.15,5882.5,3.75,44800,0.15,6122.5,3.75]
[null,44825,0.25,7387.5,6.25,44825,0.15,5886.25,{"$f":"+H1802-H1801","v":3.75},44825,0.15,6126.25,{"$f":"+L1802-L1801","v":3.75}]
[null,44850,0.25,7393.75,6.25,44850,0.15,5890,3.75,44850,0.15,6130,3.75]
[null,44875,0.25,7400,6.25,44875,0.15,5893.75,3.75,44875,0.15,6133.75,3.75]
[null,44900,0.25,7406.25,6.25,44900,0.15,5897.5,3.75,44900,0.15,6137.5,3.75]
[null,44925,0.25,7412.5,6.25,44925,0.15,5901.25,3.75,44925,0.15,6141.25,3.75]
[null,44950,0.25,7418.75,6.25,44950,0.15,5905,3.75,44950,0.15,6145,3.75]
[null,44975,0.25,7425,6.25,44975,0.15,5908.75,3.75,44975,0.15,6148.75,3.75]
[null,45000,0.25,7431.25,6.25,45000,0.15,5912.5,3.75,45000,0.15,6152.5,3.75]
[null,45025,0.25,7437.5,6.25,45025,0.15,5916.25,3.75,45025,0.15,6156.25,3.75]
[null,45050,0.25,7443.75,6.25,45050,0.15,5920,3.75,45050,0.15,6160,3.75]
[null,45075,0.25,7450,6.25,45075,0.15,5923.75,3.75,45075,0.15,6163.75,3.75]
[null,45100,0.25,7456.25,6.25,45100,0.15,5927.5,3.75,45100,0.15,6167.5,3.75]
[null,45125,0.25,7462.5,6.25,45125,0.15,5931.25,3.75,45125,0.15,6171.25,3.75]
[null,45150,0.25,7468.75,6.25,45150,0.15,5935,3.75,45150,0.15,6175,3.75]
[null,45175,0.25,7475,6.25,45175,0.15,5938.75,3.75,45175,0.15,6178.75,3.75]
[null,45200,0.25,7481.25,6.25,45200,0.15,5942.5,3.75,45200,0.15,6182.5,3.75]
[null,45225,0.25,{"$f":"+(B1818-34000)*C1818+$D$1369","v":7487.5},6.25,45225,0.15,5946.25,3.75,45225,0.15,6186.25,3.75]
[null,45250,0.25,7493.75,6.25,45250,0.15,5950,3.75,45250,0.15,6190,3.75]
[null,45275,0.25,7500,6.25,45275,0.15,5953.75,3.75,45275,0.15,6193.75,3.75]
[null,45300,0.25,7506.25,6.25,45300,0.15,5957.5,3.75,45300,0.15,6197.5,3.75]
[null,45325,0.25,7512.5,6.25,45325,0.15,5961.25,3.75,45325,0.15,6201.25,3.75]
[null,45350,0.25,7518.75,6.25,45350,0.15,5965,3.75,45350,0.15,6205,3.75]
[null,45375,0.25,7525,6.25,45375,0.15,5968.75,3.75,45375,0.15,6208.75,3.75]
[null,45400,0.25,7531.25,6.25,45400,0.15,5972.5,3.75,45400,0.15,6212.5,3.75]
[null,45425,0.25,7537.5,6.25,45425,0.15,5976.25,3.75,45425,0.15,6216.25,3.75]
[null,45450,0.25,7543.75,6.25,45450,0.15,5980,3.75,45450,0.15,6220,3.75]
[null,45475,0.25,7550,6.25,45475,0.15,5983.75,3.75,45475,0.15,6223.75,3.75]
[null,45500,0.25,7556.25,6.25,45500,0.15,5987.5,3.75,45500,0.15,6227.5,3.75]
[null,45525,0.25,7562.5,6.25,45525,0.15,5991.25,3.75,45525,0.15,6231.25,3.75]
[null,45550,0.25,7568.75,6.25,45550,0.15,5995,3.75,45550,0.15,6235,3.75]
[null,45575,0.25,7575,6.25,45575,0.15,{"$f":"+(F1832-16750)*G1832+$H$679","v":5998.75},3.75,45575,0.25,{"$f":"+(J1832-45550)*K1832+$L$1831","v":6241.25},6.25]
[null,45600,0.25,7581.25,6.25,45600,0.15,6002.5,3.75,45600,0.25,6247.5,6.25]
[null,45625,0.25,7587.5,6.25,45625,0.15,6006.25,3.75,45625,0.25,6253.75,6.25]
[null,45650,0.25,7593.75,6.25,45650,0.15,6010,3.75,45650,0.25,6260,6.25]
[null,45675,0.25,7600,6.25,45675,0.15,6013.75,3.75,45675,0.25,6266.25,6.25]
[null,45700,0.25,7606.25,6.25,45700,0.15,6017.5,3.75,45700,0.25,6272.5,6.25]
[null,45725,0.25,7612.5,6.25,45725,0.15,6021.25,3.75,45725,0.25,6278.75,6.25]
[null,45750,0.25,7618.75,6.25,45750,0.15,6025,3.75,45750,0.25,6285,6.25]
[null,45775,0.25,7625,6.25,45775,0.15,6028.75,3.75,45775,0.25,6291.25,6.25]
[null,45800,0.25,7631.25,6.25,45800,0.15,6032.5,3.75,45800,0.25,6297.5,6.25]
[null,45825,0.25,7637.5,6.25,45825,0.15,6036.25,3.75,45825,0.25,6303.75,6.25]
[null,45850,0.25,7643.75,6.25,45850,0.15,6040,3.75,45850,0.25,6310,6.25]
[null,45875,0.25,7650,6.25,45875,0.15,6043.75,3.75,45875,0.25,6316.25,6.25]
[null,45900,0.25,7656.25,{"$f":"+D1845-D1844","v":6.25},45900,0.15,6047.5,3.75,45900,0.25,6322.5,6.25]
[null,45925,0.25,7662.5,6.25,45925,0.15,6051.25,3.75,45925,0.25,6328.75,6.25]
[null,45950,0.25,7668.75,6.25,45950,0.15,6055,3.75,45950,0.25,6335,6.25]
[null,45975,0.25,7675,6.25,45975,0.15,6058.75,3.75,45975,0.25,6341.25,6.25]
[null,46000,0.25,7681.25,6.25,46000,0.15,6062.5,3.75,46000,0.25,6347.5,6.25]
[null,46025,0.25,7687.5,6.25,46025,0.15,6066.25,3.75,46025,0.25,6353.75,6.25]
[null,46050,0.25,7693.75,6.25,46050,0.15,6070,3.75,46050,0.25,6360,6.25]
[null,46075,0.25,7700,6.25,46075,0.15,6073.75,3.75,46075,0.25,6366.25,6.25]
[null,46100,0.25,7706.25,6.25,46100,0.15,6077.5,3.75,46100,0.25,6372.5,6.25]
[null,46125,0.25,7712.5,6.25,46125,0.15,6081.25,3.75,46125,0.25,6378.75,6.25]
[null,46150,0.25,7718.75,6.25,46150,0.15,6085,3.75,46150,0.25,6385,6.25]
[null,46175,0.25,7725,6.25,46175,0.15,6088.75,3.75,46175,0.25,6391.25,6.25]
[null,46200,0.25,7731.25,6.25,46200,0.15,6092.5,3.75,46200,0.25,6397.5,6.25]
[null,46225,0.25,7737.5,6.25,46225,0.15,6096.25,3.75,46225,0.25,6403.75,6.25]
[null,46250,0.25,7743.75,6.25,46250,0.15,6100,3.75,46250,0.25,6410,6.25]
[null,46275,0.25,7750,6.25,46275,0.15,6103.75,3.75,46275,0.25,6416.25,6.25]
[null,46300,0.25,7756.25,6.25,46300,0.15,6107.5,3.75,46300,0.25,6422.5,6.25]
[null,46325,0.25,7762.5,6.25,46325,0.15,6111.25,3.75,46325,0.25,6428.75,6.25]
[null,46350,0.25,7768.75,6.25,46350,0.15,6115,3.75,46350,0.25,6435,6.25]
[null,46375,0.25,7775,6.25,46375,0.15,6118.75,3.75,46375,0.25,6441.25,6.25]
[null,46400,0.25,7781.25,6.25,46400,0.15,6122.5,3.75,46400,0.25,6447.5,6.25]
[null,46425,0.25,7787.5,6.25,46425,0.15,6126.25,{"$f":"+H1866-H1865","v":3.75},46425,0.25,6453.75,{"$f":"+L1866-L1865","v":6.25}]
[null,46450,0.25,7793.75,6.25,46450,0.15,6130,3.75,46450,0.25,6460,6.25]
[null,46475,0.25,7800,6.25,46475,0.15,6133.75,3.75,46475,0.25,6466.25,6.25]
[null,46500,0.25,7806.25,6.25,46500,0.15,6137.5,3.75,46500,0.25,6472.5,6.25]
[null,46525,0.25,7812.5,6.25,46525,0.15,6141.25,3.75,46525,0.25,6478.75,6.25]
[null,46550,0.25,7818.75,6.25,46550,0.15,6145,3.75,46550,0.25,6485,6.25]
[null,46575,0.25,7825,6.25,46575,0.15,6148.75,3.75,46575,0.25,6491.25,6.25]
[null,46600,0.25,7831.25,6.25,46600,0.15,6152.5,3.75,46600,0.25,6497.5,6.25]
[null,46625,0.25,7837.5,6.25,46625,0.15,6156.25,3.75,46625,0.25,6503.75,6.25]
[null,46650,0.25,7843.75,6.25,46650,0.15,6160,3.75,46650,0.25,6510,6.25]
[null,46675,0.25,7850,6.25,46675,0.15,6163.75,3.75,46675,0.25,6516.25,6.25]
[null,46700,0.25,7856.25,6.25,46700,0.15,6167.5,3.75,46700,0.25,6522.5,6.25]
[null,46725,0.25,7862.5,6.25,46725,0.15,6171.25,3.75,46725,0.25,6528.75,6.25]
[null,46750,0.25,7868.75,6.25,46750,0.15,6175,3.75,46750,0.25,6535,6.25]
[null,46775,0.25,7875,6.25,46775,0.15,6178.75,3.75,46775,0.25,6541.25,6.25]
[null,46800,0.25,7881.25,6.25,46800,0.15,6182.5,3.75,46800,0.25,6547.5,6.25]
[null,46825,0.25,{"$f":"+(B1882-34000)*C1882+$D$1369","v":7887.5},6.25,46825,0.15,6186.25,3.75,46825,0.25,6553.75,6.25]
[null,46850,0.25,7893.75,6.25,46850,0.15,6190,3.75,46850,0.25,6560,6.25]
[null,46875,0.25,7900,6.25,46875,0.15,6193.75,3.75,46875,0.25,6566.25,6.25]
[null,46900,0.25,7906.25,6.25,46900,0.15,6197.5,3.75,46900,0.25,6572.5,6.25]
[null,46925,0.25,7912.5,6.25,46925,0.15,6201.25,3.75,46925,0.25,6578.75,6.25]
[null,46950,0.25,7918.75,6.25,46950,0.15,6205,3.75,46950,0.25,6585,6.25]
[null,46975,0.25,7925,6.25,46975,0.15,6208.75,3.75,46975,0.25,6591.25,6.25]
[null,47000,0.25,7931.25,6.25,47000,0.15,6212.5,3.75,47000,0.25,6597.5,6.25]
[null,47025,0.25,7937.5,6.25,47025,0.15,6216.25,3.75,47025,0.25,6603.75,6.25]
[null,47050,0.25,7943.75,6.25,47050,0.15,6220,3.75,47050,0.25,6610,6.25]
[null,47075,0.25,7950,6.25,47075,0.15,6223.75,3.75,47075,0.25,6616.25,6.25]
[null,47100,0.25,7956.25,6.25,47100,0.15,6227.5,3.75,47100,0.25,6622.5,6.25]
[null,47125,0.25,7962.5,6.25,47125,0.15,6231.25,3.75,47125,0.25,6628.75,6.25]
[null,47150,0.25,7968.75,6.25,47150,0.15,6235,3.75,47150,0.25,6635,6.25]
[null,47175,0.25,7975,6.25,47175,0.15,{"$f":"+(F1896-16750)*G1896+$H$679","v":6238.75},3.75,47175,0.25,{"$f":"+(J1896-45550)*K1896+$L$1831","v":6641.25},6.25]
[null,47200,0.25,7981.25,6.25,47200,0.15,6242.5,3.75,47200,0.25,6647.5,6.25]
[null,47225,0.25,7987.5,6.25,47225,0.15,6246.25,3.75,47225,0.25,6653.75,6.25]
[null,47250,0.25,7993.75,6.25,47250,0.15,6250,3.75,47250,0.25,6660,6.25]
[null,47275,0.25,8000,6.25,47275,0.15,6253.75,3.75,47275,0.25,6666.25,6.25]
[null,47300,0.25,8006.25,6.25,47300,0.15,6257.5,3.75,47300,0.25,6672.5,6.25]
[null,47325,0.25,8012.5,6.25,47325,0.15,6261.25,3.75,47325,0.25,6678.75,6.25]
[null,47350,0.25,8018.75,6.25,47350,0.15,6265,3.75,47350,0.25,6685,6.25]
[null,47375,0.25,8025,6.25,47375,0.15,6268.75,3.75,47375,0.25,6691.25,6.25]
[null,47400,0.25,8031.25,6.25,47400,0.15,6272.5,3.75,47400,0.25,6697.5,6.25]
[null,47425,0.25,8037.5,6.25,47425,0.15,6276.25,3.75,47425,0.25,6703.75,6.25]
[null,47450,0.25,8043.75,6.25,47450,0.15,6280,3.75,47450,0.25,6710,6.25]
[null,47475,0.25,8050,6.25,47475,0.15,6283.75,3.75,47475,0.25,6716.25,6.25]
[null,47500,0.25,8056.25,{"$f":"+D1909-D1908","v":6.25},47500,0.15,6287.5,3.75,47500,0.25,6722.5,6.25]
[null,47525,0.25,8062.5,6.25,47525,0.15,6291.25,3.75,47525,0.25,6728.75,6.25]
[null,47550,0.25,8068.75,6.25,47550,0.15,6295,3.75,47550,0.25,6735,6.25]
[null,47575,0.25,8075,6.25,47575,0.15,6298.75,3.75,47575,0.25,6741.25,6.25]
[null,47600,0.25,8081.25,6.25,47600,0.15,6302.5,3.75,47600,0.25,6747.5,6.25]
[null,47625,0.25,8087.5,6.25,47625,0.15,6306.25,3.75,47625,0.25,6753.75,6.25]
[null,47650,0.25,8093.75,6.25,47650,0.15,6310,3.75,47650,0.25,6760,6.25]
[null,47675,0.25,8100,6.25,47675,0.15,6313.75,3.75,47675,0.25,6766.25,6.25]
[null,47700,0.25,8106.25,6.25,47700,0.15,6317.5,3.75,47700,0.25,6772.5,6.25]
[null,47725,0.25,8112.5,6.25,47725,0.15,6321.25,3.75,47725,0.25,6778.75,6.25]
[null,47750,0.25,8118.75,6.25,47750,0.15,6325,3.75,47750,0.25,6785,6.25]
[null,47775,0.25,8125,6.25,47775,0.15,6328.75,3.75,47775,0.25,6791.25,6.25]
[null,47800,0.25,8131.25,6.25,47800,0.15,6332.5,3.75,47800,0.25,6797.5,6.25]
[null,47825,0.25,8137.5,6.25,47825,0.15,6336.25,3.75,47825,0.25,6803.75,6.25]
[null,47850,0.25,8143.75,6.25,47850,0.15,6340,3.75,47850,0.25,6810,6.25]
[null,47875,0.25,8150,6.25,47875,0.15,6343.75,3.75,47875,0.25,6816.25,6.25]
[null,47900,0.25,8156.25,6.25,47900,0.15,6347.5,3.75,47900,0.25,6822.5,6.25]
[null,47925,0.25,8162.5,6.25,47925,0.15,6351.25,3.75,47925,0.25,6828.75,6.25]
[null,47950,0.25,8168.75,6.25,47950,0.15,6355,3.75,47950,0.25,6835,6.25]
[null,47975,0.25,8175,6.25,47975,0.15,6358.75,3.75,47975,0.25,6841.25,6.25]
[null,48000,0.25,8181.25,6.25,48000,0.15,6362.5,3.75,48000,0.25,6847.5,6.25]
[null,48025,0.25,8187.5,6.25,48025,0.15,6366.25,{"$f":"+H1930-H1929","v":3.75},48025,0.25,6853.75,{"$f":"+L1930-L1929","v":6.25}]
[null,48050,0.25,8193.75,6.25,48050,0.15,6370,3.75,48050,0.25,6860,6.25]
[null,48075,0.25,8200,6.25,48075,0.15,6373.75,3.75,48075,0.25,6866.25,6.25]
[null,48100,0.25,8206.25,6.25,48100,0.15,6377.5,3.75,48100,0.25,6872.5,6.25]
[null,48125,0.25,8212.5,6.25,48125,0.15,6381.25,3.75,48125,0.25,6878.75,6.25]
[null,48150,0.25,8218.75,6.25,48150,0.15,6385,3.75,48150,0.25,6885,6.25]
[null,48175,0.25,8225,6.25,48175,0.15,6388.75,3.75,48175,0.25,6891.25,6.25]
[null,48200,0.25,8231.25,6.25,48200,0.15,6392.5,3.75,48200,0.25,6897.5,6.25]
[null,48225,0.25,8237.5,6.25,48225,0.15,6396.25,3.75,48225,0.25,6903.75,6.25]
[null,48250,0.25,8243.75,6.25,48250,0.15,6400,3.75,48250,0.25,6910,6.25]
[null,48275,0.25,8250,6.25,48275,0.15,6403.75,3.75,48275,0.25,6916.25,6.25]
[null,48300,0.25,8256.25,6.25,48300,0.15,6407.5,3.75,48300,0.25,6922.5,6.25]
[null,48325,0.25,8262.5,6.25,48325,0.15,6411.25,3.75,48325,0.25,6928.75,6.25]
[null,48350,0.25,8268.75,6.25,48350,0.15,6415,3.75,48350,0.25,6935,6.25]
[null,48375,0.25,8275,6.25,48375,0.15,6418.75,3.75,48375,0.25,6941.25,6.25]
[null,48400,0.25,8281.25,6.25,48400,0.15,6422.5,3.75,48400,0.25,6947.5,6.25]
[null,48425,0.25,{"$f":"+(B1946-34000)*C1946+$D$1369","v":8287.5},6.25,48425,0.15,6426.25,3.75,48425,0.25,6953.75,6.25]
[null,48450,0.25,8293.75,6.25,48450,0.15,6430,3.75,48450,0.25,6960,6.25]
[null,48475,0.25,8300,6.25,48475,0.15,6433.75,3.75,48475,0.25,6966.25,6.25]
[null,48500,0.25,8306.25,6.25,48500,0.15,6437.5,3.75,48500,0.25,6972.5,6.25]
[null,48525,0.25,8312.5,6.25,48525,0.15,6441.25,3.75,48525,0.25,6978.75,6.25]
[null,48550,0.25,8318.75,6.25,48550,0.15,6445,3.75,48550,0.25,6985,6.25]
[null,48575,0.25,8325,6.25,48575,0.15,6448.75,3.75,48575,0.25,6991.25,6.25]
[null,48600,0.25,8331.25,6.25,48600,0.15,6452.5,3.75,48600,0.25,6997.5,6.25]
[null,48625,0.25,8337.5,6.25,48625,0.15,6456.25,3.75,48625,0.25,7003.75,6.25]
[null,48650,0.25,8343.75,6.25,48650,0.15,6460,3.75,48650,0.25,7010,6.25]
[null,48675,0.25,8350,6.25,48675,0.15,6463.75,3.75,48675,0.25,7016.25,6.25]
[null,48700,0.25,8356.25,6.25,48700,0.15,6467.5,3.75,48700,0.25,7022.5,6.25]
[null,48725,0.25,8362.5,6.25,48725,0.15,6471.25,3.75,48725,0.25,7028.75,6.25]
[null,48750,0.25,8368.75,6.25,48750,0.15,6475,3.75,48750,0.25,7035,6.25]
[null,48775,0.25,8375,6.25,48775,0.15,{"$f":"+(F1960-16750)*G1960+$H$679","v":6478.75},3.75,48775,0.25,{"$f":"+(J1960-45550)*K1960+$L$1831","v":7041.25},6.25]
[null,48800,0.25,8381.25,6.25,48800,0.15,6482.5,3.75,48800,0.25,7047.5,6.25]
[null,48825,0.25,8387.5,6.25,48825,0.15,6486.25,3.75,48825,0.25,7053.75,6.25]
[null,48850,0.25,8393.75,6.25,48850,0.15,6490,3.75,48850,0.25,7060,6.25]
[null,48875,0.25,8400,6.25,48875,0.15,6493.75,3.75,48875,0.25,7066.25,6.25]
[null,48900,0.25,8406.25,6.25,48900,0.15,6497.5,3.75,48900,0.25,7072.5,6.25]
[null,48925,0.25,8412.5,6.25,48925,0.15,6501.25,3.75,48925,0.25,7078.75,6.25]
[null,48950,0.25,8418.75,6.25,48950,0.15,6505,3.75,48950,0.25,7085,6.25]
[null,48975,0.25,8425,6.25,48975,0.15,6508.75,3.75,48975,0.25,7091.25,6.25]
[null,49000,0.25,8431.25,6.25,49000,0.15,6512.5,3.75,49000,0.25,7097.5,6.25]
[null,49025,0.25,8437.5,6.25,49025,0.15,6516.25,3.75,49025,0.25,7103.75,6.25]
[null,49050,0.25,8443.75,6.25,49050,0.15,6520,3.75,49050,0.25,7110,6.25]
[null,49075,0.25,8450,6.25,49075,0.15,6523.75,3.75,49075,0.25,7116.25,6.25]
[null,49100,0.25,8456.25,{"$f":"+D1973-D1972","v":6.25},49100,0.15,6527.5,3.75,49100,0.25,7122.5,6.25]
[null,49125,0.25,8462.5,6.25,49125,0.15,6531.25,3.75,49125,0.25,7128.75,6.25]
[null,49150,0.25,8468.75,6.25,49150,0.15,6535,3.75,49150,0.25,7135,6.25]
[null,49175,0.25,8475,6.25,49175,0.15,6538.75,3.75,49175,0.25,7141.25,6.25]
[null,49200,0.25,8481.25,6.25,49200,0.15,6542.5,3.75,49200,0.25,7147.5,6.25]
[null,49225,0.25,8487.5,6.25,49225,0.15,6546.25,3.75,49225,0.25,7153.75,6.25]
[null,49250,0.25,8493.75,6.25,49250,0.15,6550,3.75,49250,0.25,7160,6.25]
[null,49275,0.25,8500,6.25,49275,0.15,6553.75,3.75,49275,0.25,7166.25,6.25]
[null,49300,0.25,8506.25,6.25,49300,0.15,6557.5,3.75,49300,0.25,7172.5,6.25]
[null,49325,0.25,8512.5,6.25,49325,0.15,6561.25,3.75,49325,0.25,7178.75,6.25]
[null,49350,0.25,8518.75,6.25,49350,0.15,6565,3.75,49350,0.25,7185,6.25]
[null,49375,0.25,8525,6.25,49375,0.15,6568.75,3.75,49375,0.25,7191.25,6.25]
[null,49400,0.25,8531.25,6.25,49400,0.15,6572.5,3.75,49400,0.25,7197.5,6.25]
[null,49425,0.25,8537.5,6.25,49425,0.15,6576.25,3.75,49425,0.25,7203.75,6.25]
[null,49450,0.25,8543.75,6.25,49450,0.15,6580,3.75,49450,0.25,7210,6.25]
[null,49475,0.25,8550,6.25,49475,0.15,6583.75,3.75,49475,0.25,7216.25,6.25]
[null,49500,0.25,8556.25,6.25,49500,0.15,6587.5,3.75,49500,0.25,7222.5,6.25]
[null,49525,0.25,8562.5,6.25,49525,0.15,6591.25,3.75,49525,0.25,7228.75,6.25]
[null,49550,0.25,8568.75,6.25,49550,0.15,6595,3.75,49550,0.25,7235,6.25]
[null,49575,0.25,8575,6.25,49575,0.15,6598.75,3.75,49575,0.25,7241.25,6.25]
[null,49600,0.25,8581.25,6.25,49600,0.15,6602.5,3.75,49600,0.25,7247.5,6.25]
[null,49625,0.25,8587.5,6.25,49625,0.15,6606.25,{"$f":"+H1994-H1993","v":3.75},49625,0.25,7253.75,{"$f":"+L1994-L1993","v":6.25}]
[null,49650,0.25,8593.75,6.25,49650,0.15,6610,3.75,49650,0.25,7260,6.25]
[null,49675,0.25,8600,6.25,49675,0.15,6613.75,3.75,49675,0.25,7266.25,6.25]
[null,49700,0.25,8606.25,6.25,49700,0.15,6617.5,3.75,49700,0.25,7272.5,6.25]
[null,49725,0.25,8612.5,6.25,49725,0.15,6621.25,3.75,49725,0.25,7278.75,6.25]
[null,49750,0.25,8618.75,6.25,49750,0.15,6625,3.75,49750,0.25,7285,6.25]
[null,49775,0.25,8625,6.25,49775,0.15,6628.75,3.75,49775,0.25,7291.25,6.25]
[null,49800,0.25,8631.25,6.25,49800,0.15,6632.5,3.75,49800,0.25,7297.5,6.25]
[null,49825,0.25,8637.5,6.25,49825,0.15,6636.25,3.75,49825,0.25,7303.75,6.25]
[null,49850,0.25,8643.75,6.25,49850,0.15,6640,3.75,49850,0.25,7310,6.25]
[null,49875,0.25,8650,6.25,49875,0.15,6643.75,3.75,49875,0.25,7316.25,6.25]
[null,49900,0.25,8656.25,6.25,49900,0.15,6647.5,3.75,49900,0.25,7322.5,6.25]
[null,49925,0.25,8662.5,6.25,49925,0.15,6651.25,3.75,49925,0.25,7328.75,6.25]
[null,49950,0.25,8668.75,6.25,49950,0.15,6655,3.75,49950,0.25,7335,6.25]
[null,49975,0.25,8675,6.25,49975,0.15,6658.75,3.75,49975,0.25,7341.25,6.25]
[null,50000,0.25,8681.25,6.25,50000,0.15,6662.5,3.75,50000,0.25,7347.5,6.25]
[null,50025,0.25,{"$f":"+(B2010-34000)*C2010+$D$1369","v":8687.5},6.25,50025,0.15,6666.25,3.75,50025,0.25,7353.75,6.25]
[null,50050,0.25,8693.75,6.25,50050,0.15,6670,3.75,50050,0.25,7360,6.25]
[null,50075,0.25,8700,6.25,50075,0.15,6673.75,3.75,50075,0.25,7366.25,6.25]
[null,50100,0.25,8706.25,6.25,50100,0.15,6677.5,3.75,50100,0.25,7372.5,6.25]
[null,50125,0.25,8712.5,6.25,50125,0.15,6681.25,3.75,50125,0.25,7378.75,6.25]
[null,50150,0.25,8718.75,6.25,50150,0.15,6685,3.75,50150,0.25,7385,6.25]
[null,50175,0.25,8725,6.25,50175,0.15,6688.75,3.75,50175,0.25,7391.25,6.25]
[null,50200,0.25,8731.25,6.25,50200,0.15,6692.5,3.75,50200,0.25,7397.5,6.25]
[null,50225,0.25,8737.5,6.25,50225,0.15,6696.25,3.75,50225,0.25,7403.75,6.25]
[null,50250,0.25,8743.75,6.25,50250,0.15,6700,3.75,50250,0.25,7410,6.25]
[null,50275,0.25,8750,6.25,50275,0.15,6703.75,3.75,50275,0.25,7416.25,6.25]
[null,50300,0.25,8756.25,6.25,50300,0.15,6707.5,3.75,50300,0.25,7422.5,6.25]
[null,50325,0.25,8762.5,6.25,50325,0.15,6711.25,3.75,50325,0.25,7428.75,6.25]
[null,50350,0.25,8768.75,6.25,50350,0.15,6715,3.75,50350,0.25,7435,6.25]
[null,50375,0.25,8775,6.25,50375,0.15,{"$f":"+(F2024-16750)*G2024+$H$679","v":6718.75},3.75,50375,0.25,{"$f":"+(J2024-45550)*K2024+$L$1831","v":7441.25},6.25]
[null,50400,0.25,8781.25,6.25,50400,0.15,6722.5,3.75,50400,0.25,7447.5,6.25]
[null,50425,0.25,8787.5,6.25,50425,0.15,6726.25,3.75,50425,0.25,7453.75,6.25]
[null,50450,0.25,8793.75,6.25,50450,0.15,6730,3.75,50450,0.25,7460,6.25]
[null,50475,0.25,8800,6.25,50475,0.15,6733.75,3.75,50475,0.25,7466.25,6.25]
[null,50500,0.25,8806.25,6.25,50500,0.15,6737.5,3.75,50500,0.25,7472.5,6.25]
[null,50525,0.25,8812.5,6.25,50525,0.15,6741.25,3.75,50525,0.25,7478.75,6.25]
[null,50550,0.25,8818.75,6.25,50550,0.15,6745,3.75,50550,0.25,7485,6.25]
[null,50575,0.25,8825,6.25,50575,0.15,6748.75,3.75,50575,0.25,7491.25,6.25]
[null,50600,0.25,8831.25,6.25,50600,0.15,6752.5,3.75,50600,0.25,7497.5,6.25]
[null,50625,0.25,8837.5,6.25,50625,0.15,6756.25,3.75,50625,0.25,7503.75,6.25]
[null,50650,0.25,8843.75,6.25,50650,0.15,6760,3.75,50650,0.25,7510,6.25]
[null,50675,0.25,8850,6.25,50675,0.15,6763.75,3.75,50675,0.25,7516.25,6.25]
[null,50700,0.25,8856.25,{"$f":"+D2037-D2036","v":6.25},50700,0.15,6767.5,3.75,50700,0.25,7522.5,6.25]
[null,50725,0.25,8862.5,6.25,50725,0.15,6771.25,3.75,50725,0.25,7528.75,6.25]
[null,50750,0.25,8868.75,6.25,50750,0.15,6775,3.75,50750,0.25,7535,6.25]
[null,50775,0.25,8875,6.25,50775,0.15,6778.75,3.75,50775,0.25,7541.25,6.25]
[null,50800,0.25,8881.25,6.25,50800,0.15,6782.5,3.75,50800,0.25,7547.5,6.25]
[null,50825,0.25,8887.5,6.25,50825,0.15,6786.25,3.75,50825,0.25,7553.75,6.25]
[null,50850,0.25,8893.75,6.25,50850,0.15,6790,3.75,50850,0.25,7560,6.25]
[null,50875,0.25,8900,6.25,50875,0.15,6793.75,3.75,50875,0.25,7566.25,6.25]
[null,50900,0.25,8906.25,6.25,50900,0.15,6797.5,3.75,50900,0.25,7572.5,6.25]
[null,50925,0.25,8912.5,6.25,50925,0.15,6801.25,3.75,50925,0.25,7578.75,6.25]
[null,50950,0.25,8918.75,6.25,50950,0.15,6805,3.75,50950,0.25,7585,6.25]
[null,50975,0.25,8925,6.25,50975,0.15,6808.75,3.75,50975,0.25,7591.25,6.25]
[null,51000,0.25,8931.25,6.25,51000,0.15,6812.5,3.75,51000,0.25,7597.5,6.25]
[null,51025,0.25,8937.5,6.25,51025,0.15,6816.25,3.75,51025,0.25,7603.75,6.25]
[null,51050,0.25,8943.75,6.25,51050,0.15,6820,3.75,51050,0.25,7610,6.25]
[null,51075,0.25,8950,6.25,51075,0.15,6823.75,3.75,51075,0.25,7616.25,6.25]
[null,51100,0.25,8956.25,6.25,51100,0.15,6827.5,3.75,51100,0.25,7622.5,6.25]
[null,51125,0.25,8962.5,6.25,51125,0.15,6831.25,3.75,51125,0.25,7628.75,6.25]
[null,51150,0.25,8968.75,6.25,51150,0.15,6835,3.75,51150,0.25,7635,6.25]
[null,51175,0.25,8975,6.25,51175,0.15,6838.75,3.75,51175,0.25,7641.25,6.25]
[null,51200,0.25,8981.25,6.25,51200,0.15,6842.5,3.75,51200,0.25,7647.5,6.25]
[null,51225,0.25,8987.5,6.25,51225,0.15,6846.25,{"$f":"+H2058-H2057","v":3.75},51225,0.25,7653.75,{"$f":"+L2058-L2057","v":6.25}]
[null,51250,0.25,8993.75,6.25,51250,0.15,6850,3.75,51250,0.25,7660,6.25]
[null,51275,0.25,9000,6.25,51275,0.15,6853.75,3.75,51275,0.25,7666.25,6.25]
[null,51300,0.25,9006.25,6.25,51300,0.15,6857.5,3.75,51300,0.25,7672.5,6.25]
[null,51325,0.25,9012.5,6.25,51325,0.15,6861.25,3.75,51325,0.25,7678.75,6.25]
[null,51350,0.25,9018.75,6.25,51350,0.15,6865,3.75,51350,0.25,7685,6.25]
[null,51375,0.25,9025,6.25,51375,0.15,6868.75,3.75,51375,0.25,7691.25,6.25]
[null,51400,0.25,9031.25,6.25,51400,0.15,6872.5,3.75,51400,0.25,7697.5,6.25]
[null,51425,0.25,9037.5,6.25,51425,0.15,6876.25,3.75,51425,0.25,7703.75,6.25]
[null,51450,0.25,9043.75,6.25,51450,0.15,6880,3.75,51450,0.25,7710,6.25]
[null,51475,0.25,9050,6.25,51475,0.15,6883.75,3.75,51475,0.25,7716.25,6.25]
[null,51500,0.25,9056.25,6.25,51500,0.15,6887.5,3.75,51500,0.25,7722.5,6.25]
[null,51525,0.25,9062.5,6.25,51525,0.15,6891.25,3.75,51525,0.25,7728.75,6.25]
[null,51550,0.25,9068.75,6.25,51550,0.15,6895,3.75,51550,0.25,7735,6.25]
[null,51575,0.25,9075,6.25,51575,0.15,6898.75,3.75,51575,0.25,7741.25,6.25]
[null,51600,0.25,9081.25,6.25,51600,0.15,6902.5,3.75,51600,0.25,7747.5,6.25]
[null,51625,0.25,{"$f":"+(B2074-34000)*C2074+$D$1369","v":9087.5},6.25,51625,0.15,6906.25,3.75,51625,0.25,7753.75,6.25]
[null,51650,0.25,9093.75,6.25,51650,0.15,6910,3.75,51650,0.25,7760,6.25]
[null,51675,0.25,9100,6.25,51675,0.15,6913.75,3.75,51675,0.25,7766.25,6.25]
[null,51700,0.25,9106.25,6.25,51700,0.15,6917.5,3.75,51700,0.25,7772.5,6.25]
[null,51725,0.25,9112.5,6.25,51725,0.15,6921.25,3.75,51725,0.25,7778.75,6.25]
[null,51750,0.25,9118.75,6.25,51750,0.15,6925,3.75,51750,0.25,7785,6.25]
[null,51775,0.25,9125,6.25,51775,0.15,6928.75,3.75,51775,0.25,7791.25,6.25]
[null,51800,0.25,9131.25,6.25,51800,0.15,6932.5,3.75,51800,0.25,7797.5,6.25]
[null,51825,0.25,9137.5,6.25,51825,0.15,6936.25,3.75,51825,0.25,7803.75,6.25]
[null,51850,0.25,9143.75,6.25,51850,0.15,6940,3.75,51850,0.25,7810,6.25]
[null,51875,0.25,9150,6.25,51875,0.15,6943.75,3.75,51875,0.25,7816.25,6.25]
[null,51900,0.25,9156.25,6.25,51900,0.15,6947.5,3.75,51900,0.25,7822.5,6.25]
[null,51925,0.25,9162.5,6.25,51925,0.15,6951.25,3.75,51925,0.25,7828.75,6.25]
[null,51950,0.25,9168.75,6.25,51950,0.15,6955,3.75,51950,0.25,7835,6.25]
[null,51975,0.25,9175,6.25,51975,0.15,{"$f":"+(F2088-16750)*G2088+$H$679","v":6958.75},3.75,51975,0.25,{"$f":"+(J2088-45550)*K2088+$L$1831","v":7841.25},6.25]
[null,52000,0.25,9181.25,6.25,52000,0.15,6962.5,3.75,52000,0.25,7847.5,6.25]
[null,52025,0.25,9187.5,6.25,52025,0.15,6966.25,3.75,52025,0.25,7853.75,6.25]
[null,52050,0.25,9193.75,6.25,52050,0.15,6970,3.75,52050,0.25,7860,6.25]
[null,52075,0.25,9200,6.25,52075,0.15,6973.75,3.75,52075,0.25,7866.25,6.25]
[null,52100,0.25,9206.25,6.25,52100,0.15,6977.5,3.75,52100,0.25,7872.5,6.25]
[null,52125,0.25,9212.5,6.25,52125,0.15,6981.25,3.75,52125,0.25,7878.75,6.25]
[null,52150,0.25,9218.75,6.25,52150,0.15,6985,3.75,52150,0.25,7885,6.25]
[null,52175,0.25,9225,6.25,52175,0.15,6988.75,3.75,52175,0.25,7891.25,6.25]
[null,52200,0.25,9231.25,6.25,52200,0.15,6992.5,3.75,52200,0.25,7897.5,6.25]
[null,52225,0.25,9237.5,6.25,52225,0.15,6996.25,3.75,52225,0.25,7903.75,6.25]
[null,52250,0.25,9243.75,6.25,52250,0.15,7000,3.75,52250,0.25,7910,6.25]
[null,52275,0.25,9250,6.25,52275,0.15,7003.75,3.75,52275,0.25,7916.25,6.25]
[null,52300,0.25,9256.25,{"$f":"+D2101-D2100","v":6.25},52300,0.15,7007.5,3.75,52300,0.25,7922.5,6.25]
[null,52325,0.25,9262.5,6.25,52325,0.15,7011.25,3.75,52325,0.25,7928.75,6.25]
[null,52350,0.25,9268.75,6.25,52350,0.15,7015,3.75,52350,0.25,7935,6.25]
[null,52375,0.25,9275,6.25,52375,0.15,7018.75,3.75,52375,0.25,7941.25,6.25]
[null,52400,0.25,9281.25,6.25,52400,0.15,7022.5,3.75,52400,0.25,7947.5,6.25]
[null,52425,0.25,9287.5,6.25,52425,0.15,7026.25,3.75,52425,0.25,7953.75,6.25]
[null,52450,0.25,9293.75,6.25,52450,0.15,7030,3.75,52450,0.25,7960,6.25]
[null,52475,0.25,9300,6.25,52475,0.15,7033.75,3.75,52475,0.25,7966.25,6.25]
[null,52500,0.25,9306.25,6.25,52500,0.15,7037.5,3.75,52500,0.25,7972.5,6.25]
[null,52525,0.25,9312.5,6.25,52525,0.15,7041.25,3.75,52525,0.25,7978.75,6.25]
[null,52550,0.25,9318.75,6.25,52550,0.15,7045,3.75,52550,0.25,7985,6.25]
[null,52575,0.25,9325,6.25,52575,0.15,7048.75,3.75,52575,0.25,7991.25,6.25]
[null,52600,0.25,9331.25,6.25,52600,0.15,7052.5,3.75,52600,0.25,7997.5,6.25]
[null,52625,0.25,9337.5,6.25,52625,0.15,7056.25,3.75,52625,0.25,8003.75,6.25]
[null,52650,0.25,9343.75,6.25,52650,0.15,7060,3.75,52650,0.25,8010,6.25]
[null,52675,0.25,9350,6.25,52675,0.15,7063.75,3.75,52675,0.25,8016.25,6.25]
[null,52700,0.25,9356.25,6.25,52700,0.15,7067.5,3.75,52700,0.25,8022.5,6.25]
[null,52725,0.25,9362.5,6.25,52725,0.15,7071.25,3.75,52725,0.25,8028.75,6.25]
[null,52750,0.25,9368.75,6.25,52750,0.15,7075,3.75,52750,0.25,8035,6.25]
[null,52775,0.25,9375,6.25,52775,0.15,7078.75,3.75,52775,0.25,8041.25,6.25]
[null,52800,0.25,9381.25,6.25,52800,0.15,7082.5,3.75,52800,0.25,8047.5,6.25]
[null,52825,0.25,9387.5,6.25,52825,0.15,7086.25,{"$f":"+H2122-H2121","v":3.75},52825,0.25,8053.75,{"$f":"+L2122-L2121","v":6.25}]
[null,52850,0.25,9393.75,6.25,52850,0.15,7090,3.75,52850,0.25,8060,6.25]
[null,52875,0.25,9400,6.25,52875,0.15,7093.75,3.75,52875,0.25,8066.25,6.25]
[null,52900,0.25,9406.25,6.25,52900,0.15,7097.5,3.75,52900,0.25,8072.5,6.25]
[null,52925,0.25,9412.5,6.25,52925,0.15,7101.25,3.75,52925,0.25,8078.75,6.25]
[null,52950,0.25,9418.75,6.25,52950,0.15,7105,3.75,52950,0.25,8085,6.25]
[null,52975,0.25,9425,6.25,52975,0.15,7108.75,3.75,52975,0.25,8091.25,6.25]
[null,53000,0.25,9431.25,6.25,53000,0.15,7112.5,3.75,53000,0.25,8097.5,6.25]
[null,53025,0.25,9437.5,6.25,53025,0.15,7116.25,3.75,53025,0.25,8103.75,6.25]
[null,53050,0.25,9443.75,6.25,53050,0.15,7120,3.75,53050,0.25,8110,6.25]
[null,53075,0.25,9450,6.25,53075,0.15,7123.75,3.75,53075,0.25,8116.25,6.25]
[null,53100,0.25,9456.25,6.25,53100,0.15,7127.5,3.75,53100,0.25,8122.5,6.25]
[null,53125,0.25,9462.5,6.25,53125,0.15,7131.25,3.75,53125,0.25,8128.75,6.25]
[null,53150,0.25,9468.75,6.25,53150,0.15,7135,3.75,53150,0.25,8135,6.25]
[null,53175,0.25,9475,6.25,53175,0.15,7138.75,3.75,53175,0.25,8141.25,6.25]
[null,53200,0.25,9481.25,6.25,53200,0.15,7142.5,3.75,53200,0.25,8147.5,6.25]
[null,53225,0.25,{"$f":"+(B2138-34000)*C2138+$D$1369","v":9487.5},6.25,53225,0.15,7146.25,3.75,53225,0.25,8153.75,6.25]
[null,53250,0.25,9493.75,6.25,53250,0.15,7150,3.75,53250,0.25,8160,6.25]
[null,53275,0.25,9500,6.25,53275,0.15,7153.75,3.75,53275,0.25,8166.25,6.25]
[null,53300,0.25,9506.25,6.25,53300,0.15,7157.5,3.75,53300,0.25,8172.5,6.25]
[null,53325,0.25,9512.5,6.25,53325,0.15,7161.25,3.75,53325,0.25,8178.75,6.25]
[null,53350,0.25,9518.75,6.25,53350,0.15,7165,3.75,53350,0.25,8185,6.25]
[null,53375,0.25,9525,6.25,53375,0.15,7168.75,3.75,53375,0.25,8191.25,6.25]
[null,53400,0.25,9531.25,6.25,53400,0.15,7172.5,3.75,53400,0.25,8197.5,6.25]
[null,53425,0.25,9537.5,6.25,53425,0.15,7176.25,3.75,53425,0.25,8203.75,6.25]
[null,53450,0.25,9543.75,6.25,53450,0.15,7180,3.75,53450,0.25,8210,6.25]
[null,53475,0.25,9550,6.25,53475,0.15,7183.75,3.75,53475,0.25,8216.25,6.25]
[null,53500,0.25,9556.25,6.25,53500,0.15,7187.5,3.75,53500,0.25,8222.5,6.25]
[null,53525,0.25,9562.5,6.25,53525,0.15,7191.25,3.75,53525,0.25,8228.75,6.25]
[null,53550,0.25,9568.75,6.25,53550,0.15,7195,3.75,53550,0.25,8235,6.25]
[null,53575,0.25,9575,6.25,53575,0.15,{"$f":"+(F2152-16750)*G2152+$H$679","v":7198.75},3.75,53575,0.25,{"$f":"+(J2152-45550)*K2152+$L$1831","v":8241.25},6.25]
[null,53600,0.25,9581.25,6.25,53600,0.15,7202.5,3.75,53600,0.25,8247.5,6.25]
[null,53625,0.25,9587.5,6.25,53625,0.15,7206.25,3.75,53625,0.25,8253.75,6.25]
[null,53650,0.25,9593.75,6.25,53650,0.15,7210,3.75,53650,0.25,8260,6.25]
[null,53675,0.25,9600,6.25,53675,0.15,7213.75,3.75,53675,0.25,8266.25,6.25]
[null,53700,0.25,9606.25,6.25,53700,0.15,7217.5,3.75,53700,0.25,8272.5,6.25]
[null,53725,0.25,9612.5,6.25,53725,0.15,7221.25,3.75,53725,0.25,8278.75,6.25]
[null,53750,0.25,9618.75,6.25,53750,0.15,7225,3.75,53750,0.25,8285,6.25]
[null,53775,0.25,9625,6.25,53775,0.15,7228.75,3.75,53775,0.25,8291.25,6.25]
[null,53800,0.25,9631.25,6.25,53800,0.15,7232.5,3.75,53800,0.25,8297.5,6.25]
[null,53825,0.25,9637.5,6.25,53825,0.15,7236.25,3.75,53825,0.25,8303.75,6.25]
[null,53850,0.25,9643.75,6.25,53850,0.15,7240,3.75,53850,0.25,8310,6.25]
[null,53875,0.25,9650,6.25,53875,0.15,7243.75,3.75,53875,0.25,8316.25,6.25]
[null,53900,0.25,9656.25,{"$f":"+D2165-D2164","v":6.25},53900,0.15,7247.5,3.75,53900,0.25,8322.5,6.25]
[null,53925,0.25,9662.5,6.25,53925,0.15,7251.25,3.75,53925,0.25,8328.75,6.25]
[null,53950,0.25,9668.75,6.25,53950,0.15,7255,3.75,53950,0.25,8335,6.25]
[null,53975,0.25,9675,6.25,53975,0.15,7258.75,3.75,53975,0.25,8341.25,6.25]
[null,54000,0.25,9681.25,6.25,54000,0.15,7262.5,3.75,54000,0.25,8347.5,6.25]
[null,54025,0.25,9687.5,6.25,54025,0.15,7266.25,3.75,54025,0.25,8353.75,6.25]
[null,54050,0.25,9693.75,6.25,54050,0.15,7270,3.75,54050,0.25,8360,6.25]
[null,54075,0.25,9700,6.25,54075,0.15,7273.75,3.75,54075,0.25,8366.25,6.25]
[null,54100,0.25,9706.25,6.25,54100,0.15,7277.5,3.75,54100,0.25,8372.5,6.25]
[null,54125,0.25,9712.5,6.25,54125,0.15,7281.25,3.75,54125,0.25,8378.75,6.25]
[null,54150,0.25,9718.75,6.25,54150,0.15,7285,3.75,54150,0.25,8385,6.25]
[null,54175,0.25,9725,6.25,54175,0.15,7288.75,3.75,54175,0.25,8391.25,6.25]
[null,54200,0.25,9731.25,6.25,54200,0.15,7292.5,3.75,54200,0.25,8397.5,6.25]
[null,54225,0.25,9737.5,6.25,54225,0.15,7296.25,3.75,54225,0.25,8403.75,6.25]
[null,54250,0.25,9743.75,6.25,54250,0.15,7300,3.75,54250,0.25,8410,6.25]
[null,54275,0.25,9750,6.25,54275,0.15,7303.75,3.75,54275,0.25,8416.25,6.25]
[null,54300,0.25,9756.25,6.25,54300,0.15,7307.5,3.75,54300,0.25,8422.5,6.25]
[null,54325,0.25,9762.5,6.25,54325,0.15,7311.25,3.75,54325,0.25,8428.75,6.25]
[null,54350,0.25,9768.75,6.25,54350,0.15,7315,3.75,54350,0.25,8435,6.25]
[null,54375,0.25,9775,6.25,54375,0.15,7318.75,3.75,54375,0.25,8441.25,6.25]
[null,54400,0.25,9781.25,6.25,54400,0.15,7322.5,3.75,54400,0.25,8447.5,6.25]
[null,54425,0.25,9787.5,6.25,54425,0.15,7326.25,{"$f":"+H2186-H2185","v":3.75},54425,0.25,8453.75,{"$f":"+L2186-L2185","v":6.25}]
[null,54450,0.25,9793.75,6.25,54450,0.15,7330,3.75,54450,0.25,8460,6.25]
[null,54475,0.25,9800,6.25,54475,0.15,7333.75,3.75,54475,0.25,8466.25,6.25]
[null,54500,0.25,9806.25,6.25,54500,0.15,7337.5,3.75,54500,0.25,8472.5,6.25]
[null,54525,0.25,9812.5,6.25,54525,0.15,7341.25,3.75,54525,0.25,8478.75,6.25]
[null,54550,0.25,9818.75,6.25,54550,0.15,7345,3.75,54550,0.25,8485,6.25]
[null,54575,0.25,9825,6.25,54575,0.15,7348.75,3.75,54575,0.25,8491.25,6.25]
[null,54600,0.25,9831.25,6.25,54600,0.15,7352.5,3.75,54600,0.25,8497.5,6.25]
[null,54625,0.25,9837.5,6.25,54625,0.15,7356.25,3.75,54625,0.25,8503.75,6.25]
[null,54650,0.25,9843.75,6.25,54650,0.15,7360,3.75,54650,0.25,8510,6.25]
[null,54675,0.25,9850,6.25,54675,0.15,7363.75,3.75,54675,0.25,8516.25,6.25]
[null,54700,0.25,9856.25,6.25,54700,0.15,7367.5,3.75,54700,0.25,8522.5,6.25]
[null,54725,0.25,9862.5,6.25,54725,0.15,7371.25,3.75,54725,0.25,8528.75,6.25]
[null,54750,0.25,9868.75,6.25,54750,0.15,7375,3.75,54750,0.25,8535,6.25]
[null,54775,0.25,9875,6.25,54775,0.15,7378.75,3.75,54775,0.25,8541.25,6.25]
[null,54800,0.25,9881.25,6.25,54800,0.15,7382.5,3.75,54800,0.25,8547.5,6.25]
[null,54825,0.25,{"$f":"+(B2202-34000)*C2202+$D$1369","v":9887.5},6.25,54825,0.15,7386.25,3.75,54825,0.25,8553.75,6.25]
[null,54850,0.25,9893.75,6.25,54850,0.15,7390,3.75,54850,0.25,8560,6.25]
[null,54875,0.25,9900,6.25,54875,0.15,7393.75,3.75,54875,0.25,8566.25,6.25]
[null,54900,0.25,9906.25,6.25,54900,0.15,7397.5,3.75,54900,0.25,8572.5,6.25]
[null,54925,0.25,9912.5,6.25,54925,0.15,7401.25,3.75,54925,0.25,8578.75,6.25]
[null,54950,0.25,9918.75,6.25,54950,0.15,7405,3.75,54950,0.25,8585,6.25]
[null,54975,0.25,9925,6.25,54975,0.15,7408.75,3.75,54975,0.25,8591.25,6.25]
[null,55000,0.25,9931.25,6.25,55000,0.15,7412.5,3.75,55000,0.25,8597.5,6.25]
[null,55025,0.25,9937.5,6.25,55025,0.15,7416.25,3.75,55025,0.25,8603.75,6.25]
[null,55050,0.25,9943.75,6.25,55050,0.15,7420,3.75,55050,0.25,8610,6.25]
[null,55075,0.25,9950,6.25,55075,0.15,7423.75,3.75,55075,0.25,8616.25,6.25]
[null,55100,0.25,9956.25,6.25,55100,0.15,7427.5,3.75,55100,0.25,8622.5,6.25]
[null,55125,0.25,9962.5,6.25,55125,0.15,7431.25,3.75,55125,0.25,8628.75,6.25]
[null,55150,0.25,9968.75,6.25,55150,0.15,7435,3.75,55150,0.25,8635,6.25]
[null,55175,0.25,9975,6.25,55175,0.15,{"$f":"+(F2216-16750)*G2216+$H$679","v":7438.75},3.75,55175,0.25,{"$f":"+(J2216-45550)*K2216+$L$1831","v":8641.25},6.25]
[null,55200,0.25,9981.25,6.25,55200,0.15,7442.5,3.75,55200,0.25,8647.5,6.25]
[null,55225,0.25,9987.5,6.25,55225,0.15,7446.25,3.75,55225,0.25,8653.75,6.25]
[null,55250,0.25,9993.75,6.25,55250,0.15,7450,3.75,55250,0.25,8660,6.25]
[null,55275,0.25,10000,6.25,55275,0.15,7453.75,3.75,55275,0.25,8666.25,6.25]
[null,55300,0.25,10006.25,6.25,55300,0.15,7457.5,3.75,55300,0.25,8672.5,6.25]
[null,55325,0.25,10012.5,6.25,55325,0.15,7461.25,3.75,55325,0.25,8678.75,6.25]
[null,55350,0.25,10018.75,6.25,55350,0.15,7465,3.75,55350,0.25,8685,6.25]
[null,55375,0.25,10025,6.25,55375,0.15,7468.75,3.75,55375,0.25,8691.25,6.25]
[null,55400,0.25,10031.25,6.25,55400,0.15,7472.5,3.75,55400,0.25,8697.5,6.25]
[null,55425,0.25,10037.5,6.25,55425,0.15,7476.25,3.75,55425,0.25,8703.75,6.25]
[null,55450,0.25,10043.75,6.25,55450,0.15,7480,3.75,55450,0.25,8710,6.25]
[null,55475,0.25,10050,6.25,55475,0.15,7483.75,3.75,55475,0.25,8716.25,6.25]
[null,55500,0.25,10056.25,{"$f":"+D2229-D2228","v":6.25},55500,0.15,7487.5,3.75,55500,0.25,8722.5,6.25]
[null,55525,0.25,10062.5,6.25,55525,0.15,7491.25,3.75,55525,0.25,8728.75,6.25]
[null,55550,0.25,10068.75,6.25,55550,0.15,7495,3.75,55550,0.25,8735,6.25]
[null,55575,0.25,10075,6.25,55575,0.15,7498.75,3.75,55575,0.25,8741.25,6.25]
[null,55600,0.25,10081.25,6.25,55600,0.15,7502.5,3.75,55600,0.25,8747.5,6.25]
[null,55625,0.25,10087.5,6.25,55625,0.15,7506.25,3.75,55625,0.25,8753.75,6.25]
[null,55650,0.25,10093.75,6.25,55650,0.15,7510,3.75,55650,0.25,8760,6.25]
[null,55675,0.25,10100,6.25,55675,0.15,7513.75,3.75,55675,0.25,8766.25,6.25]
[null,55700,0.25,10106.25,6.25,55700,0.15,7517.5,3.75,55700,0.25,8772.5,6.25]
[null,55725,0.25,10112.5,6.25,55725,0.15,7521.25,3.75,55725,0.25,8778.75,6.25]
[null,55750,0.25,10118.75,6.25,55750,0.15,7525,3.75,55750,0.25,8785,6.25]
[null,55775,0.25,10125,6.25,55775,0.15,7528.75,3.75,55775,0.25,8791.25,6.25]
[null,55800,0.25,10131.25,6.25,55800,0.15,7532.5,3.75,55800,0.25,8797.5,6.25]
[null,55825,0.25,10137.5,6.25,55825,0.15,7536.25,3.75,55825,0.25,8803.75,6.25]
[null,55850,0.25,10143.75,6.25,55850,0.15,7540,3.75,55850,0.25,8810,6.25]
[null,55875,0.25,10150,6.25,55875,0.15,7543.75,3.75,55875,0.25,8816.25,6.25]
[null,55900,0.25,10156.25,6.25,55900,0.15,7547.5,3.75,55900,0.25,8822.5,6.25]
[null,55925,0.25,10162.5,6.25,55925,0.15,7551.25,3.75,55925,0.25,8828.75,6.25]
[null,55950,0.25,10168.75,6.25,55950,0.15,7555,3.75,55950,0.25,8835,6.25]
[null,55975,0.25,10175,6.25,55975,0.15,7558.75,3.75,55975,0.25,8841.25,6.25]
[null,56000,0.25,10181.25,6.25,56000,0.15,7562.5,3.75,56000,0.25,8847.5,6.25]
[null,56025,0.25,10187.5,6.25,56025,0.15,7566.25,{"$f":"+H2250-H2249","v":3.75},56025,0.25,8853.75,{"$f":"+L2250-L2249","v":6.25}]
[null,56050,0.25,10193.75,6.25,56050,0.15,7570,3.75,56050,0.25,8860,6.25]
[null,56075,0.25,10200,6.25,56075,0.15,7573.75,3.75,56075,0.25,8866.25,6.25]
[null,56100,0.25,10206.25,6.25,56100,0.15,7577.5,3.75,56100,0.25,8872.5,6.25]
[null,56125,0.25,10212.5,6.25,56125,0.15,7581.25,3.75,56125,0.25,8878.75,6.25]
[null,56150,0.25,10218.75,6.25,56150,0.15,7585,3.75,56150,0.25,8885,6.25]
[null,56175,0.25,10225,6.25,56175,0.15,7588.75,3.75,56175,0.25,8891.25,6.25]
[null,56200,0.25,10231.25,6.25,56200,0.15,7592.5,3.75,56200,0.25,8897.5,6.25]
[null,56225,0.25,10237.5,6.25,56225,0.15,7596.25,3.75,56225,0.25,8903.75,6.25]
[null,56250,0.25,10243.75,6.25,56250,0.15,7600,3.75,56250,0.25,8910,6.25]
[null,56275,0.25,10250,6.25,56275,0.15,7603.75,3.75,56275,0.25,8916.25,6.25]
[null,56300,0.25,10256.25,6.25,56300,0.15,7607.5,3.75,56300,0.25,8922.5,6.25]
[null,56325,0.25,10262.5,6.25,56325,0.15,7611.25,3.75,56325,0.25,8928.75,6.25]
[null,56350,0.25,10268.75,6.25,56350,0.15,7615,3.75,56350,0.25,8935,6.25]
[null,56375,0.25,10275,6.25,56375,0.15,7618.75,3.75,56375,0.25,8941.25,6.25]
[null,56400,0.25,10281.25,6.25,56400,0.15,7622.5,3.75,56400,0.25,8947.5,6.25]
[null,56425,0.25,{"$f":"+(B2266-34000)*C2266+$D$1369","v":10287.5},6.25,56425,0.15,7626.25,3.75,56425,0.25,8953.75,6.25]
[null,56450,0.25,10293.75,6.25,56450,0.15,7630,3.75,56450,0.25,8960,6.25]
[null,56475,0.25,10300,6.25,56475,0.15,7633.75,3.75,56475,0.25,8966.25,6.25]
[null,56500,0.25,10306.25,6.25,56500,0.15,7637.5,3.75,56500,0.25,8972.5,6.25]
[null,56525,0.25,10312.5,6.25,56525,0.15,7641.25,3.75,56525,0.25,8978.75,6.25]
[null,56550,0.25,10318.75,6.25,56550,0.15,7645,3.75,56550,0.25,8985,6.25]
[null,56575,0.25,10325,6.25,56575,0.15,7648.75,3.75,56575,0.25,8991.25,6.25]
[null,56600,0.25,10331.25,6.25,56600,0.15,7652.5,3.75,56600,0.25,8997.5,6.25]
[null,56625,0.25,10337.5,6.25,56625,0.15,7656.25,3.75,56625,0.25,9003.75,6.25]
[null,56650,0.25,10343.75,6.25,56650,0.15,7660,3.75,56650,0.25,9010,6.25]
[null,56675,0.25,10350,6.25,56675,0.15,7663.75,3.75,56675,0.25,9016.25,6.25]
[null,56700,0.25,10356.25,6.25,56700,0.15,7667.5,3.75,56700,0.25,9022.5,6.25]
[null,56725,0.25,10362.5,6.25,56725,0.15,7671.25,3.75,56725,0.25,9028.75,6.25]
[null,56750,0.25,10368.75,6.25,56750,0.15,7675,3.75,56750,0.25,9035,6.25]
[null,56775,0.25,10375,6.25,56775,0.15,{"$f":"+(F2280-16750)*G2280+$H$679","v":7678.75},3.75,56775,0.25,{"$f":"+(J2280-45550)*K2280+$L$1831","v":9041.25},6.25]
[null,56800,0.25,10381.25,6.25,56800,0.15,7682.5,3.75,56800,0.25,9047.5,6.25]
[null,56825,0.25,10387.5,6.25,56825,0.15,7686.25,3.75,56825,0.25,9053.75,6.25]
[null,56850,0.25,10393.75,6.25,56850,0.15,7690,3.75,56850,0.25,9060,6.25]
[null,56875,0.25,10400,6.25,56875,0.15,7693.75,3.75,56875,0.25,9066.25,6.25]
[null,56900,0.25,10406.25,6.25,56900,0.15,7697.5,3.75,56900,0.25,9072.5,6.25]
[null,56925,0.25,10412.5,6.25,56925,0.15,7701.25,3.75,56925,0.25,9078.75,6.25]
[null,56950,0.25,10418.75,6.25,56950,0.15,7705,3.75,56950,0.25,9085,6.25]
[null,56975,0.25,10425,6.25,56975,0.15,7708.75,3.75,56975,0.25,9091.25,6.25]
[null,57000,0.25,10431.25,6.25,57000,0.15,7712.5,3.75,57000,0.25,9097.5,6.25]
[null,57025,0.25,10437.5,6.25,57025,0.15,7716.25,3.75,57025,0.25,9103.75,6.25]
[null,57050,0.25,10443.75,6.25,57050,0.15,7720,3.75,57050,0.25,9110,6.25]
[null,57075,0.25,10450,6.25,57075,0.15,7723.75,3.75,57075,0.25,9116.25,6.25]
[null,57100,0.25,10456.25,{"$f":"+D2293-D2292","v":6.25},57100,0.15,7727.5,3.75,57100,0.25,9122.5,6.25]
[null,57125,0.25,10462.5,6.25,57125,0.15,7731.25,3.75,57125,0.25,9128.75,6.25]
[null,57150,0.25,10468.75,6.25,57150,0.15,7735,3.75,57150,0.25,9135,6.25]
[null,57175,0.25,10475,6.25,57175,0.15,7738.75,3.75,57175,0.25,9141.25,6.25]
[null,57200,0.25,10481.25,6.25,57200,0.15,7742.5,3.75,57200,0.25,9147.5,6.25]
[null,57225,0.25,10487.5,6.25,57225,0.15,7746.25,3.75,57225,0.25,9153.75,6.25]
[null,57250,0.25,10493.75,6.25,57250,0.15,7750,3.75,57250,0.25,9160,6.25]
[null,57275,0.25,10500,6.25,57275,0.15,7753.75,3.75,57275,0.25,9166.25,6.25]
[null,57300,0.25,10506.25,6.25,57300,0.15,7757.5,3.75,57300,0.25,9172.5,6.25]
[null,57325,0.25,10512.5,6.25,57325,0.15,7761.25,3.75,57325,0.25,9178.75,6.25]
[null,57350,0.25,10518.75,6.25,57350,0.15,7765,3.75,57350,0.25,9185,6.25]
[null,57375,0.25,10525,6.25,57375,0.15,7768.75,3.75,57375,0.25,9191.25,6.25]
[null,57400,0.25,10531.25,6.25,57400,0.15,7772.5,3.75,57400,0.25,9197.5,6.25]
[null,57425,0.25,10537.5,6.25,57425,0.15,7776.25,3.75,57425,0.25,9203.75,6.25]
[null,57450,0.25,10543.75,6.25,57450,0.15,7780,3.75,57450,0.25,9210,6.25]
[null,57475,0.25,10550,6.25,57475,0.15,7783.75,3.75,57475,0.25,9216.25,6.25]
[null,57500,0.25,10556.25,6.25,57500,0.15,7787.5,3.75,57500,0.25,9222.5,6.25]
[null,57525,0.25,10562.5,6.25,57525,0.15,7791.25,3.75,57525,0.25,9228.75,6.25]
[null,57550,0.25,10568.75,6.25,57550,0.15,7795,3.75,57550,0.25,9235,6.25]
[null,57575,0.25,10575,6.25,57575,0.15,7798.75,3.75,57575,0.25,9241.25,6.25]
[null,57600,0.25,10581.25,6.25,57600,0.15,7802.5,3.75,57600,0.25,9247.5,6.25]
[null,57625,0.25,10587.5,6.25,57625,0.15,7806.25,{"$f":"+H2314-H2313","v":3.75},57625,0.25,9253.75,{"$f":"+L2314-L2313","v":6.25}]
[null,57650,0.25,10593.75,6.25,57650,0.15,7810,3.75,57650,0.25,9260,6.25]
[null,57675,0.25,10600,6.25,57675,0.15,7813.75,3.75,57675,0.25,9266.25,6.25]
[null,57700,0.25,10606.25,6.25,57700,0.15,7817.5,3.75,57700,0.25,9272.5,6.25]
[null,57725,0.25,10612.5,6.25,57725,0.15,7821.25,3.75,57725,0.25,9278.75,6.25]
[null,57750,0.25,10618.75,6.25,57750,0.15,7825,3.75,57750,0.25,9285,6.25]
[null,57775,0.25,10625,6.25,57775,0.15,7828.75,3.75,57775,0.25,9291.25,6.25]
[null,57800,0.25,10631.25,6.25,57800,0.15,7832.5,3.75,57800,0.25,9297.5,6.25]
[null,57825,0.25,10637.5,6.25,57825,0.15,7836.25,3.75,57825,0.25,9303.75,6.25]
[null,57850,0.25,10643.75,6.25,57850,0.15,7840,3.75,57850,0.25,9310,6.25]
[null,57875,0.25,10650,6.25,57875,0.15,7843.75,3.75,57875,0.25,9316.25,6.25]
[null,57900,0.25,10656.25,6.25,57900,0.15,7847.5,3.75,57900,0.25,9322.5,6.25]
[null,57925,0.25,10662.5,6.25,57925,0.15,7851.25,3.75,57925,0.25,9328.75,6.25]
[null,57950,0.25,10668.75,6.25,57950,0.15,7855,3.75,57950,0.25,9335,6.25]
[null,57975,0.25,10675,6.25,57975,0.15,7858.75,3.75,57975,0.25,9341.25,6.25]
[null,58000,0.25,10681.25,6.25,58000,0.15,7862.5,3.75,58000,0.25,9347.5,6.25]
[null,58025,0.25,{"$f":"+(B2330-34000)*C2330+$D$1369","v":10687.5},6.25,58025,0.15,7866.25,3.75,58025,0.25,9353.75,6.25]
[null,58050,0.25,10693.75,6.25,58050,0.15,7870,3.75,58050,0.25,9360,6.25]
[null,58075,0.25,10700,6.25,58075,0.15,7873.75,3.75,58075,0.25,9366.25,6.25]
[null,58100,0.25,10706.25,6.25,58100,0.15,7877.5,3.75,58100,0.25,9372.5,6.25]
[null,58125,0.25,10712.5,6.25,58125,0.15,7881.25,3.75,58125,0.25,9378.75,6.25]
[null,58150,0.25,10718.75,6.25,58150,0.15,7885,3.75,58150,0.25,9385,6.25]
[null,58175,0.25,10725,6.25,58175,0.15,7888.75,3.75,58175,0.25,9391.25,6.25]
[null,58200,0.25,10731.25,6.25,58200,0.15,7892.5,3.75,58200,0.25,9397.5,6.25]
[null,58225,0.25,10737.5,6.25,58225,0.15,7896.25,3.75,58225,0.25,9403.75,6.25]
[null,58250,0.25,10743.75,6.25,58250,0.15,7900,3.75,58250,0.25,9410,6.25]
[null,58275,0.25,10750,6.25,58275,0.15,7903.75,3.75,58275,0.25,9416.25,6.25]
[null,58300,0.25,10756.25,6.25,58300,0.15,7907.5,3.75,58300,0.25,9422.5,6.25]
[null,58325,0.25,10762.5,6.25,58325,0.15,7911.25,3.75,58325,0.25,9428.75,6.25]
[null,58350,0.25,10768.75,6.25,58350,0.15,7915,3.75,58350,0.25,9435,6.25]
[null,58375,0.25,10775,6.25,58375,0.15,{"$f":"+(F2344-16750)*G2344+$H$679","v":7918.75},3.75,58375,0.25,{"$f":"+(J2344-45550)*K2344+$L$1831","v":9441.25},6.25]
[null,58400,0.25,10781.25,6.25,58400,0.15,7922.5,3.75,58400,0.25,9447.5,6.25]
[null,58425,0.25,10787.5,6.25,58425,0.15,7926.25,3.75,58425,0.25,9453.75,6.25]
[null,58450,0.25,10793.75,6.25,58450,0.15,7930,3.75,58450,0.25,9460,6.25]
[null,58475,0.25,10800,6.25,58475,0.15,7933.75,3.75,58475,0.25,9466.25,6.25]
[null,58500,0.25,10806.25,6.25,58500,0.15,7937.5,3.75,58500,0.25,9472.5,6.25]
[null,58525,0.25,10812.5,6.25,58525,0.15,7941.25,3.75,58525,0.25,9478.75,6.25]
[null,58550,0.25,10818.75,6.25,58550,0.15,7945,3.75,58550,0.25,9485,6.25]
[null,58575,0.25,10825,6.25,58575,0.15,7948.75,3.75,58575,0.25,9491.25,6.25]
[null,58600,0.25,10831.25,6.25,58600,0.15,7952.5,3.75,58600,0.25,9497.5,6.25]
[null,58625,0.25,10837.5,6.25,58625,0.15,7956.25,3.75,58625,0.25,9503.75,6.25]
[null,58650,0.25,10843.75,6.25,58650,0.15,7960,3.75,58650,0.25,9510,6.25]
[null,58675,0.25,10850,6.25,58675,0.15,7963.75,3.75,58675,0.25,9516.25,6.25]
[null,58700,0.25,10856.25,{"$f":"+D2357-D2356","v":6.25},58700,0.15,7967.5,3.75,58700,0.25,9522.5,6.25]
[null,58725,0.25,10862.5,6.25,58725,0.15,7971.25,3.75,58725,0.25,9528.75,6.25]
[null,58750,0.25,10868.75,6.25,58750,0.15,7975,3.75,58750,0.25,9535,6.25]
[null,58775,0.25,10875,6.25,58775,0.15,7978.75,3.75,58775,0.25,9541.25,6.25]
[null,58800,0.25,10881.25,6.25,58800,0.15,7982.5,3.75,58800,0.25,9547.5,6.25]
[null,58825,0.25,10887.5,6.25,58825,0.15,7986.25,3.75,58825,0.25,9553.75,6.25]
[null,58850,0.25,10893.75,6.25,58850,0.15,7990,3.75,58850,0.25,9560,6.25]
[null,58875,0.25,10900,6.25,58875,0.15,7993.75,3.75,58875,0.25,9566.25,6.25]
[null,58900,0.25,10906.25,6.25,58900,0.15,7997.5,3.75,58900,0.25,9572.5,6.25]
[null,58925,0.25,10912.5,6.25,58925,0.15,8001.25,3.75,58925,0.25,9578.75,6.25]
[null,58950,0.25,10918.75,6.25,58950,0.15,8005,3.75,58950,0.25,9585,6.25]
[null,58975,0.25,10925,6.25,58975,0.15,8008.75,3.75,58975,0.25,9591.25,6.25]
[null,59000,0.25,10931.25,6.25,59000,0.15,8012.5,3.75,59000,0.25,9597.5,6.25]
[null,59025,0.25,10937.5,6.25,59025,0.15,8016.25,3.75,59025,0.25,9603.75,6.25]
[null,59050,0.25,10943.75,6.25,59050,0.15,8020,3.75,59050,0.25,9610,6.25]
[null,59075,0.25,10950,6.25,59075,0.15,8023.75,3.75,59075,0.25,9616.25,6.25]
[null,59100,0.25,10956.25,6.25,59100,0.15,8027.5,3.75,59100,0.25,9622.5,6.25]
[null,59125,0.25,10962.5,6.25,59125,0.15,8031.25,3.75,59125,0.25,9628.75,6.25]
[null,59150,0.25,10968.75,6.25,59150,0.15,8035,3.75,59150,0.25,9635,6.25]
[null,59175,0.25,10975,6.25,59175,0.15,8038.75,3.75,59175,0.25,9641.25,6.25]
[null,59200,0.25,10981.25,6.25,59200,0.15,8042.5,3.75,59200,0.25,9647.5,6.25]
[null,59225,0.25,10987.5,6.25,59225,0.15,8046.25,{"$f":"+H2378-H2377","v":3.75},59225,0.25,9653.75,{"$f":"+L2378-L2377","v":6.25}]
[null,59250,0.25,10993.75,6.25,59250,0.15,8050,3.75,59250,0.25,9660,6.25]
[null,59275,0.25,11000,6.25,59275,0.15,8053.75,3.75,59275,0.25,9666.25,6.25]
[null,59300,0.25,11006.25,6.25,59300,0.15,8057.5,3.75,59300,0.25,9672.5,6.25]
[null,59325,0.25,11012.5,6.25,59325,0.15,8061.25,3.75,59325,0.25,9678.75,6.25]
[null,59350,0.25,11018.75,6.25,59350,0.15,8065,3.75,59350,0.25,9685,6.25]
[null,59375,0.25,11025,6.25,59375,0.15,8068.75,3.75,59375,0.25,9691.25,6.25]
[null,59400,0.25,11031.25,6.25,59400,0.15,8072.5,3.75,59400,0.25,9697.5,6.25]
[null,59425,0.25,11037.5,6.25,59425,0.15,8076.25,3.75,59425,0.25,9703.75,6.25]
[null,59450,0.25,11043.75,6.25,59450,0.15,8080,3.75,59450,0.25,9710,6.25]
[null,59475,0.25,11050,6.25,59475,0.15,8083.75,3.75,59475,0.25,9716.25,6.25]
[null,59500,0.25,11056.25,6.25,59500,0.15,8087.5,3.75,59500,0.25,9722.5,6.25]
[null,59525,0.25,11062.5,6.25,59525,0.15,8091.25,3.75,59525,0.25,9728.75,6.25]
[null,59550,0.25,11068.75,6.25,59550,0.15,8095,3.75,59550,0.25,9735,6.25]
[null,59575,0.25,11075,6.25,59575,0.15,8098.75,3.75,59575,0.25,9741.25,6.25]
[null,59600,0.25,11081.25,6.25,59600,0.15,8102.5,3.75,59600,0.25,9747.5,6.25]
[null,59625,0.25,{"$f":"+(B2394-34000)*C2394+$D$1369","v":11087.5},6.25,59625,0.15,8106.25,3.75,59625,0.25,9753.75,6.25]
[null,59650,0.25,11093.75,6.25,59650,0.15,8110,3.75,59650,0.25,9760,6.25]
[null,59675,0.25,11100,6.25,59675,0.15,8113.75,3.75,59675,0.25,9766.25,6.25]
[null,59700,0.25,11106.25,6.25,59700,0.15,8117.5,3.75,59700,0.25,9772.5,6.25]
[null,59725,0.25,11112.5,6.25,59725,0.15,8121.25,3.75,59725,0.25,9778.75,6.25]
[null,59750,0.25,11118.75,6.25,59750,0.15,8125,3.75,59750,0.25,9785,6.25]
[null,59775,0.25,11125,6.25,59775,0.15,8128.75,3.75,59775,0.25,9791.25,6.25]
[null,59800,0.25,11131.25,6.25,59800,0.15,8132.5,3.75,59800,0.25,9797.5,6.25]
[null,59825,0.25,11137.5,6.25,59825,0.15,8136.25,3.75,59825,0.25,9803.75,6.25]
[null,59850,0.25,11143.75,6.25,59850,0.15,8140,3.75,59850,0.25,9810,6.25]
[null,59875,0.25,11150,6.25,59875,0.15,8143.75,3.75,59875,0.25,9816.25,6.25]
[null,59900,0.25,11156.25,6.25,59900,0.15,8147.5,3.75,59900,0.25,9822.5,6.25]
[null,59925,0.25,11162.5,6.25,59925,0.15,8151.25,3.75,59925,0.25,9828.75,6.25]
[null,59950,0.25,11168.75,6.25,59950,0.15,8155,3.75,59950,0.25,9835,6.25]
[null,59975,0.25,11175,6.25,59975,0.15,{"$f":"+(F2408-16750)*G2408+$H$679","v":8158.75},3.75,59975,0.25,{"$f":"+(J2408-45550)*K2408+$L$1831","v":9841.25},6.25]
[null,60000,0.25,11181.25,6.25,60000,0.15,8162.5,3.75,60000,0.25,9847.5,6.25]
[null,60025,0.25,11187.5,6.25,60025,0.15,8166.25,3.75,60025,0.25,9853.75,6.25]
[null,60050,0.25,11193.75,6.25,60050,0.15,8170,3.75,60050,0.25,9860,6.25]
[null,60075,0.25,11200,6.25,60075,0.15,8173.75,3.75,60075,0.25,9866.25,6.25]
[null,60100,0.25,11206.25,6.25,60100,0.15,8177.5,3.75,60100,0.25,9872.5,6.25]
[null,60125,0.25,11212.5,6.25,60125,0.15,8181.25,3.75,60125,0.25,9878.75,6.25]
[null,60150,0.25,11218.75,6.25,60150,0.15,8185,3.75,60150,0.25,9885,6.25]
[null,60175,0.25,11225,6.25,60175,0.15,8188.75,3.75,60175,0.25,9891.25,6.25]
[null,60200,0.25,11231.25,6.25,60200,0.15,8192.5,3.75,60200,0.25,9897.5,6.25]
[null,60225,0.25,11237.5,6.25,60225,0.15,8196.25,3.75,60225,0.25,9903.75,6.25]
[null,60250,0.25,11243.75,6.25,60250,0.15,8200,3.75,60250,0.25,9910,6.25]
[null,60275,0.25,11250,6.25,60275,0.15,8203.75,3.75,60275,0.25,9916.25,6.25]
[null,60300,0.25,11256.25,{"$f":"+D2421-D2420","v":6.25},60300,0.15,8207.5,3.75,60300,0.25,9922.5,6.25]
[null,60325,0.25,11262.5,6.25,60325,0.15,8211.25,3.75,60325,0.25,9928.75,6.25]
[null,60350,0.25,11268.75,6.25,60350,0.15,8215,3.75,60350,0.25,9935,6.25]
[null,60375,0.25,11275,6.25,60375,0.15,8218.75,3.75,60375,0.25,9941.25,6.25]
[null,60400,0.25,11281.25,6.25,60400,0.15,8222.5,3.75,60400,0.25,9947.5,6.25]
[null,60425,0.25,11287.5,6.25,60425,0.15,8226.25,3.75,60425,0.25,9953.75,6.25]
[null,60450,0.25,11293.75,6.25,60450,0.15,8230,3.75,60450,0.25,9960,6.25]
[null,60475,0.25,11300,6.25,60475,0.15,8233.75,3.75,60475,0.25,9966.25,6.25]
[null,60500,0.25,11306.25,6.25,60500,0.15,8237.5,3.75,60500,0.25,9972.5,6.25]
[null,60525,0.25,11312.5,6.25,60525,0.15,8241.25,3.75,60525,0.25,9978.75,6.25]
[null,60550,0.25,11318.75,6.25,60550,0.15,8245,3.75,60550,0.25,9985,6.25]
[null,60575,0.25,11325,6.25,60575,0.15,8248.75,3.75,60575,0.25,9991.25,6.25]
[null,60600,0.25,11331.25,6.25,60600,0.15,8252.5,3.75,60600,0.25,9997.5,6.25]
[null,60625,0.25,11337.5,6.25,60625,0.15,8256.25,3.75,60625,0.25,10003.75,6.25]
[null,60650,0.25,11343.75,6.25,60650,0.15,8260,3.75,60650,0.25,10010,6.25]
[null,60675,0.25,11350,6.25,60675,0.15,8263.75,3.75,60675,0.25,10016.25,6.25]
[null,60700,0.25,11356.25,6.25,60700,0.15,8267.5,3.75,60700,0.25,10022.5,6.25]
[null,60725,0.25,11362.5,6.25,60725,0.15,8271.25,3.75,60725,0.25,10028.75,6.25]
[null,60750,0.25,11368.75,6.25,60750,0.15,8275,3.75,60750,0.25,10035,6.25]
[null,60775,0.25,11375,6.25,60775,0.15,8278.75,3.75,60775,0.25,10041.25,6.25]
[null,60800,0.25,11381.25,6.25,60800,0.15,8282.5,3.75,60800,0.25,10047.5,6.25]
[null,60825,0.25,11387.5,6.25,60825,0.15,8286.25,{"$f":"+H2442-H2441","v":3.75},60825,0.25,10053.75,{"$f":"+L2442-L2441","v":6.25}]
[null,60850,0.25,11393.75,6.25,60850,0.15,8290,3.75,60850,0.25,10060,6.25]
[null,60875,0.25,11400,6.25,60875,0.15,8293.75,3.75,60875,0.25,10066.25,6.25]
[null,60900,0.25,11406.25,6.25,60900,0.15,8297.5,3.75,60900,0.25,10072.5,6.25]
[null,60925,0.25,11412.5,6.25,60925,0.15,8301.25,3.75,60925,0.25,10078.75,6.25]
[null,60950,0.25,11418.75,6.25,60950,0.15,8305,3.75,60950,0.25,10085,6.25]
[null,60975,0.25,11425,6.25,60975,0.15,8308.75,3.75,60975,0.25,10091.25,6.25]
[null,61000,0.25,11431.25,6.25,61000,0.15,8312.5,3.75,61000,0.25,10097.5,6.25]
[null,61025,0.25,11437.5,6.25,61025,0.15,8316.25,3.75,61025,0.25,10103.75,6.25]
[null,61050,0.25,11443.75,6.25,61050,0.15,8320,3.75,61050,0.25,10110,6.25]
[null,61075,0.25,11450,6.25,61075,0.15,8323.75,3.75,61075,0.25,10116.25,6.25]
[null,61100,0.25,11456.25,6.25,61100,0.15,8327.5,3.75,61100,0.25,10122.5,6.25]
[null,61125,0.25,11462.5,6.25,61125,0.15,8331.25,3.75,61125,0.25,10128.75,6.25]
[null,61150,0.25,11468.75,6.25,61150,0.15,8335,3.75,61150,0.25,10135,6.25]
[null,61175,0.25,11475,6.25,61175,0.15,8338.75,3.75,61175,0.25,10141.25,6.25]
[null,61200,0.25,11481.25,6.25,61200,0.15,8342.5,3.75,61200,0.25,10147.5,6.25]
[null,61225,0.25,{"$f":"+(B2458-34000)*C2458+$D$1369","v":11487.5},6.25,61225,0.15,8346.25,3.75,61225,0.25,10153.75,6.25]
[null,61250,0.25,11493.75,6.25,61250,0.15,8350,3.75,61250,0.25,10160,6.25]
[null,61275,0.25,11500,6.25,61275,0.15,8353.75,3.75,61275,0.25,10166.25,6.25]
[null,61300,0.25,11506.25,6.25,61300,0.15,8357.5,3.75,61300,0.25,10172.5,6.25]
[null,61325,0.25,11512.5,6.25,61325,0.15,8361.25,3.75,61325,0.25,10178.75,6.25]
[null,61350,0.25,11518.75,6.25,61350,0.15,8365,3.75,61350,0.25,10185,6.25]
[null,61375,0.25,11525,6.25,61375,0.15,8368.75,3.75,61375,0.25,10191.25,6.25]
[null,61400,0.25,11531.25,6.25,61400,0.15,8372.5,3.75,61400,0.25,10197.5,6.25]
[null,61425,0.25,11537.5,6.25,61425,0.15,8376.25,3.75,61425,0.25,10203.75,6.25]
[null,61450,0.25,11543.75,6.25,61450,0.15,8380,3.75,61450,0.25,10210,6.25]
[null,61475,0.25,11550,6.25,61475,0.15,8383.75,3.75,61475,0.25,10216.25,6.25]
[null,61500,0.25,11556.25,6.25,61500,0.15,8387.5,3.75,61500,0.25,10222.5,6.25]
[null,61525,0.25,11562.5,6.25,61525,0.15,8391.25,3.75,61525,0.25,10228.75,6.25]
[null,61550,0.25,11568.75,6.25,61550,0.15,8395,3.75,61550,0.25,10235,6.25]
[null,61575,0.25,11575,6.25,61575,0.15,{"$f":"+(F2472-16750)*G2472+$H$679","v":8398.75},3.75,61575,0.25,{"$f":"+(J2472-45550)*K2472+$L$1831","v":10241.25},6.25]
[null,61600,0.25,11581.25,6.25,61600,0.15,8402.5,3.75,61600,0.25,10247.5,6.25]
[null,61625,0.25,11587.5,6.25,61625,0.15,8406.25,3.75,61625,0.25,10253.75,6.25]
[null,61650,0.25,11593.75,6.25,61650,0.15,8410,3.75,61650,0.25,10260,6.25]
[null,61675,0.25,11600,6.25,61675,0.15,8413.75,3.75,61675,0.25,10266.25,6.25]
[null,61700,0.25,11606.25,6.25,61700,0.15,8417.5,3.75,61700,0.25,10272.5,6.25]
[null,61725,0.25,11612.5,6.25,61725,0.15,8421.25,3.75,61725,0.25,10278.75,6.25]
[null,61750,0.25,11618.75,6.25,61750,0.15,8425,3.75,61750,0.25,10285,6.25]
[null,61775,0.25,11625,6.25,61775,0.15,8428.75,3.75,61775,0.25,10291.25,6.25]
[null,61800,0.25,11631.25,6.25,61800,0.15,8432.5,3.75,61800,0.25,10297.5,6.25]
[null,61825,0.25,11637.5,6.25,61825,0.15,8436.25,3.75,61825,0.25,10303.75,6.25]
[null,61850,0.25,11643.75,6.25,61850,0.15,8440,3.75,61850,0.25,10310,6.25]
[null,61875,0.25,11650,6.25,61875,0.15,8443.75,3.75,61875,0.25,10316.25,6.25]
[null,61900,0.25,11656.25,{"$f":"+D2485-D2484","v":6.25},61900,0.15,8447.5,3.75,61900,0.25,10322.5,6.25]
[null,61925,0.25,11662.5,6.25,61925,0.15,8451.25,3.75,61925,0.25,10328.75,6.25]
[null,61950,0.25,11668.75,6.25,61950,0.15,8455,3.75,61950,0.25,10335,6.25]
[null,61975,0.25,11675,6.25,61975,0.15,8458.75,3.75,61975,0.25,10341.25,6.25]
[null,62000,0.25,11681.25,6.25,62000,0.15,8462.5,3.75,62000,0.25,10347.5,6.25]
[null,62025,0.25,11687.5,6.25,62025,0.15,8466.25,3.75,62025,0.25,10353.75,6.25]
[null,62050,0.25,11693.75,6.25,62050,0.15,8470,3.75,62050,0.25,10360,6.25]
[null,62075,0.25,11700,6.25,62075,0.15,8473.75,3.75,62075,0.25,10366.25,6.25]
[null,62100,0.25,11706.25,6.25,62100,0.15,8477.5,3.75,62100,0.25,10372.5,6.25]
[null,62125,0.25,11712.5,6.25,62125,0.15,8481.25,3.75,62125,0.25,10378.75,6.25]
[null,62150,0.25,11718.75,6.25,62150,0.15,8485,3.75,62150,0.25,10385,6.25]
[null,62175,0.25,11725,6.25,62175,0.15,8488.75,3.75,62175,0.25,10391.25,6.25]
[null,62200,0.25,11731.25,6.25,62200,0.15,8492.5,3.75,62200,0.25,10397.5,6.25]
[null,62225,0.25,11737.5,6.25,62225,0.15,8496.25,3.75,62225,0.25,10403.75,6.25]
[null,62250,0.25,11743.75,6.25,62250,0.15,8500,3.75,62250,0.25,10410,6.25]
[null,62275,0.25,11750,6.25,62275,0.15,8503.75,3.75,62275,0.25,10416.25,6.25]
[null,62300,0.25,11756.25,6.25,62300,0.15,8507.5,3.75,62300,0.25,10422.5,6.25]
[null,62325,0.25,11762.5,6.25,62325,0.15,8511.25,3.75,62325,0.25,10428.75,6.25]
[null,62350,0.25,11768.75,6.25,62350,0.15,8515,3.75,62350,0.25,10435,6.25]
[null,62375,0.25,11775,6.25,62375,0.15,8518.75,3.75,62375,0.25,10441.25,6.25]
[null,62400,0.25,11781.25,6.25,62400,0.15,8522.5,3.75,62400,0.25,10447.5,6.25]
[null,62425,0.25,11787.5,6.25,62425,0.15,8526.25,{"$f":"+H2506-H2505","v":3.75},62425,0.25,10453.75,{"$f":"+L2506-L2505","v":6.25}]
[null,62450,0.25,11793.75,6.25,62450,0.15,8530,3.75,62450,0.25,10460,6.25]
[null,62475,0.25,11800,6.25,62475,0.15,8533.75,3.75,62475,0.25,10466.25,6.25]
[null,62500,0.25,11806.25,6.25,62500,0.15,8537.5,3.75,62500,0.25,10472.5,6.25]
[null,62525,0.25,11812.5,6.25,62525,0.15,8541.25,3.75,62525,0.25,10478.75,6.25]
[null,62550,0.25,11818.75,6.25,62550,0.15,8545,3.75,62550,0.25,10485,6.25]
[null,62575,0.25,11825,6.25,62575,0.15,8548.75,3.75,62575,0.25,10491.25,6.25]
[null,62600,0.25,11831.25,6.25,62600,0.15,8552.5,3.75,62600,0.25,10497.5,6.25]
[null,62625,0.25,11837.5,6.25,62625,0.15,8556.25,3.75,62625,0.25,10503.75,6.25]
[null,62650,0.25,11843.75,6.25,62650,0.15,8560,3.75,62650,0.25,10510,6.25]
[null,62675,0.25,11850,6.25,62675,0.15,8563.75,3.75,62675,0.25,10516.25,6.25]
[null,62700,0.25,11856.25,6.25,62700,0.15,8567.5,3.75,62700,0.25,10522.5,6.25]
[null,62725,0.25,11862.5,6.25,62725,0.15,8571.25,3.75,62725,0.25,10528.75,6.25]
[null,62750,0.25,11868.75,6.25,62750,0.15,8575,3.75,62750,0.25,10535,6.25]
[null,62775,0.25,11875,6.25,62775,0.15,8578.75,3.75,62775,0.25,10541.25,6.25]
[null,62800,0.25,11881.25,6.25,62800,0.15,8582.5,3.75,62800,0.25,10547.5,6.25]
[null,62825,0.25,{"$f":"+(B2522-34000)*C2522+$D$1369","v":11887.5},6.25,62825,0.15,8586.25,3.75,62825,0.25,10553.75,6.25]
[null,62850,0.25,11893.75,6.25,62850,0.15,8590,3.75,62850,0.25,10560,6.25]
[null,62875,0.25,11900,6.25,62875,0.15,8593.75,3.75,62875,0.25,10566.25,6.25]
[null,62900,0.25,11906.25,6.25,62900,0.15,8597.5,3.75,62900,0.25,10572.5,6.25]
[null,62925,0.25,11912.5,6.25,62925,0.15,8601.25,3.75,62925,0.25,10578.75,6.25]
[null,62950,0.25,11918.75,6.25,62950,0.15,8605,3.75,62950,0.25,10585,6.25]
[null,62975,0.25,11925,6.25,62975,0.15,8608.75,3.75,62975,0.25,10591.25,6.25]
[null,63000,0.25,11931.25,6.25,63000,0.15,8612.5,3.75,63000,0.25,10597.5,6.25]
[null,63025,0.25,11937.5,6.25,63025,0.15,8616.25,3.75,63025,0.25,10603.75,6.25]
[null,63050,0.25,11943.75,6.25,63050,0.15,8620,3.75,63050,0.25,10610,6.25]
[null,63075,0.25,11950,6.25,63075,0.15,8623.75,3.75,63075,0.25,10616.25,6.25]
[null,63100,0.25,11956.25,6.25,63100,0.15,8627.5,3.75,63100,0.25,10622.5,6.25]
[null,63125,0.25,11962.5,6.25,63125,0.15,8631.25,3.75,63125,0.25,10628.75,6.25]
[null,63150,0.25,11968.75,6.25,63150,0.15,8635,3.75,63150,0.25,10635,6.25]
[null,63175,0.25,11975,6.25,63175,0.15,{"$f":"+(F2536-16750)*G2536+$H$679","v":8638.75},3.75,63175,0.25,{"$f":"+(J2536-45550)*K2536+$L$1831","v":10641.25},6.25]
[null,63200,0.25,11981.25,6.25,63200,0.15,8642.5,3.75,63200,0.25,10647.5,6.25]
[null,63225,0.25,11987.5,6.25,63225,0.15,8646.25,3.75,63225,0.25,10653.75,6.25]
[null,63250,0.25,11993.75,6.25,63250,0.15,8650,3.75,63250,0.25,10660,6.25]
[null,63275,0.25,12000,6.25,63275,0.15,8653.75,3.75,63275,0.25,10666.25,6.25]
[null,63300,0.25,12006.25,6.25,63300,0.15,8657.5,3.75,63300,0.25,10672.5,6.25]
[null,63325,0.25,12012.5,6.25,63325,0.15,8661.25,3.75,63325,0.25,10678.75,6.25]
[null,63350,0.25,12018.75,6.25,63350,0.15,8665,3.75,63350,0.25,10685,6.25]
[null,63375,0.25,12025,6.25,63375,0.15,8668.75,3.75,63375,0.25,10691.25,6.25]
[null,63400,0.25,12031.25,6.25,63400,0.15,8672.5,3.75,63400,0.25,10697.5,6.25]
[null,63425,0.25,12037.5,6.25,63425,0.15,8676.25,3.75,63425,0.25,10703.75,6.25]
[null,63450,0.25,12043.75,6.25,63450,0.15,8680,3.75,63450,0.25,10710,6.25]
[null,63475,0.25,12050,6.25,63475,0.15,8683.75,3.75,63475,0.25,10716.25,6.25]
[null,63500,0.25,12056.25,{"$f":"+D2549-D2548","v":6.25},63500,0.15,8687.5,3.75,63500,0.25,10722.5,6.25]
[null,63525,0.25,12062.5,6.25,63525,0.15,8691.25,3.75,63525,0.25,10728.75,6.25]
[null,63550,0.25,12068.75,6.25,63550,0.15,8695,3.75,63550,0.25,10735,6.25]
[null,63575,0.25,12075,6.25,63575,0.15,8698.75,3.75,63575,0.25,10741.25,6.25]
[null,63600,0.25,12081.25,6.25,63600,0.15,8702.5,3.75,63600,0.25,10747.5,6.25]
[null,63625,0.25,12087.5,6.25,63625,0.15,8706.25,3.75,63625,0.25,10753.75,6.25]
[null,63650,0.25,12093.75,6.25,63650,0.15,8710,3.75,63650,0.25,10760,6.25]
[null,63675,0.25,12100,6.25,63675,0.15,8713.75,3.75,63675,0.25,10766.25,6.25]
[null,63700,0.25,12106.25,6.25,63700,0.15,8717.5,3.75,63700,0.25,10772.5,6.25]
[null,63725,0.25,12112.5,6.25,63725,0.15,8721.25,3.75,63725,0.25,10778.75,6.25]
[null,63750,0.25,12118.75,6.25,63750,0.15,8725,3.75,63750,0.25,10785,6.25]
[null,63775,0.25,12125,6.25,63775,0.15,8728.75,3.75,63775,0.25,10791.25,6.25]
[null,63800,0.25,12131.25,6.25,63800,0.15,8732.5,3.75,63800,0.25,10797.5,6.25]
[null,63825,0.25,12137.5,6.25,63825,0.15,8736.25,3.75,63825,0.25,10803.75,6.25]
[null,63850,0.25,12143.75,6.25,63850,0.15,8740,3.75,63850,0.25,10810,6.25]
[null,63875,0.25,12150,6.25,63875,0.15,8743.75,3.75,63875,0.25,10816.25,6.25]
[null,63900,0.25,12156.25,6.25,63900,0.15,8747.5,3.75,63900,0.25,10822.5,6.25]
[null,63925,0.25,12162.5,6.25,63925,0.15,8751.25,3.75,63925,0.25,10828.75,6.25]
[null,63950,0.25,12168.75,6.25,63950,0.15,8755,3.75,63950,0.25,10835,6.25]
[null,63975,0.25,12175,6.25,63975,0.15,8758.75,3.75,63975,0.25,10841.25,6.25]
[null,64000,0.25,12181.25,6.25,64000,0.15,8762.5,3.75,64000,0.25,10847.5,6.25]
[null,64025,0.25,12187.5,6.25,64025,0.15,8766.25,{"$f":"+H2570-H2569","v":3.75},64025,0.25,10853.75,{"$f":"+L2570-L2569","v":6.25}]
[null,64050,0.25,12193.75,6.25,64050,0.15,8770,3.75,64050,0.25,10860,6.25]
[null,64075,0.25,12200,6.25,64075,0.15,8773.75,3.75,64075,0.25,10866.25,6.25]
[null,64100,0.25,12206.25,6.25,64100,0.15,8777.5,3.75,64100,0.25,10872.5,6.25]
[null,64125,0.25,12212.5,6.25,64125,0.15,8781.25,3.75,64125,0.25,10878.75,6.25]
[null,64150,0.25,12218.75,6.25,64150,0.15,8785,3.75,64150,0.25,10885,6.25]
[null,64175,0.25,12225,6.25,64175,0.15,8788.75,3.75,64175,0.25,10891.25,6.25]
[null,64200,0.25,12231.25,6.25,64200,0.15,8792.5,3.75,64200,0.25,10897.5,6.25]
[null,64225,0.25,12237.5,6.25,64225,0.15,8796.25,3.75,64225,0.25,10903.75,6.25]
[null,64250,0.25,12243.75,6.25,64250,0.15,8800,3.75,64250,0.25,10910,6.25]
[null,64275,0.25,12250,6.25,64275,0.15,8803.75,3.75,64275,0.25,10916.25,6.25]
[null,64300,0.25,12256.25,6.25,64300,0.15,8807.5,3.75,64300,0.25,10922.5,6.25]
[null,64325,0.25,12262.5,6.25,64325,0.15,8811.25,3.75,64325,0.25,10928.75,6.25]
[null,64350,0.25,12268.75,6.25,64350,0.15,8815,3.75,64350,0.25,10935,6.25]
[null,64375,0.25,12275,6.25,64375,0.15,8818.75,3.75,64375,0.25,10941.25,6.25]
[null,64400,0.25,12281.25,6.25,64400,0.15,8822.5,3.75,64400,0.25,10947.5,6.25]
[null,64425,0.25,{"$f":"+(B2586-34000)*C2586+$D$1369","v":12287.5},6.25,64425,0.15,8826.25,3.75,64425,0.25,10953.75,6.25]
[null,64450,0.25,12293.75,6.25,64450,0.15,8830,3.75,64450,0.25,10960,6.25]
[null,64475,0.25,12300,6.25,64475,0.15,8833.75,3.75,64475,0.25,10966.25,6.25]
[null,64500,0.25,12306.25,6.25,64500,0.15,8837.5,3.75,64500,0.25,10972.5,6.25]
[null,64525,0.25,12312.5,6.25,64525,0.15,8841.25,3.75,64525,0.25,10978.75,6.25]
[null,64550,0.25,12318.75,6.25,64550,0.15,8845,3.75,64550,0.25,10985,6.25]
[null,64575,0.25,12325,6.25,64575,0.15,8848.75,3.75,64575,0.25,10991.25,6.25]
[null,64600,0.25,12331.25,6.25,64600,0.15,8852.5,3.75,64600,0.25,10997.5,6.25]
[null,64625,0.25,12337.5,6.25,64625,0.15,8856.25,3.75,64625,0.25,11003.75,6.25]
[null,64650,0.25,12343.75,6.25,64650,0.15,8860,3.75,64650,0.25,11010,6.25]
[null,64675,0.25,12350,6.25,64675,0.15,8863.75,3.75,64675,0.25,11016.25,6.25]
[null,64700,0.25,12356.25,6.25,64700,0.15,8867.5,3.75,64700,0.25,11022.5,6.25]
[null,64725,0.25,12362.5,6.25,64725,0.15,8871.25,3.75,64725,0.25,11028.75,6.25]
[null,64750,0.25,12368.75,6.25,64750,0.15,8875,3.75,64750,0.25,11035,6.25]
[null,64775,0.25,12375,6.25,64775,0.15,{"$f":"+(F2600-16750)*G2600+$H$679","v":8878.75},3.75,64775,0.25,{"$f":"+(J2600-45550)*K2600+$L$1831","v":11041.25},6.25]
[null,64800,0.25,12381.25,6.25,64800,0.15,8882.5,3.75,64800,0.25,11047.5,6.25]
[null,64825,0.25,12387.5,6.25,64825,0.15,8886.25,3.75,64825,0.25,11053.75,6.25]
[null,64850,0.25,12393.75,6.25,64850,0.15,8890,3.75,64850,0.25,11060,6.25]
[null,64875,0.25,12400,6.25,64875,0.15,8893.75,3.75,64875,0.25,11066.25,6.25]
[null,64900,0.25,12406.25,6.25,64900,0.15,8897.5,3.75,64900,0.25,11072.5,6.25]
[null,64925,0.25,12412.5,6.25,64925,0.15,8901.25,3.75,64925,0.25,11078.75,6.25]
[null,64950,0.25,12418.75,6.25,64950,0.15,8905,3.75,64950,0.25,11085,6.25]
[null,64975,0.25,12425,6.25,64975,0.15,8908.75,3.75,64975,0.25,11091.25,6.25]
[null,65000,0.25,12431.25,6.25,65000,0.15,8912.5,3.75,65000,0.25,11097.5,6.25]
[null,65025,0.25,12437.5,6.25,65025,0.15,8916.25,3.75,65025,0.25,11103.75,6.25]
[null,65050,0.25,12443.75,6.25,65050,0.15,8920,3.75,65050,0.25,11110,6.25]
[null,65075,0.25,12450,6.25,65075,0.15,8923.75,3.75,65075,0.25,11116.25,6.25]
[null,65100,0.25,12456.25,{"$f":"+D2613-D2612","v":6.25},65100,0.15,8927.5,3.75,65100,0.25,11122.5,6.25]
[null,65125,0.25,12462.5,6.25,65125,0.15,8931.25,3.75,65125,0.25,11128.75,6.25]
[null,65150,0.25,12468.75,6.25,65150,0.15,8935,3.75,65150,0.25,11135,6.25]
[null,65175,0.25,12475,6.25,65175,0.15,8938.75,3.75,65175,0.25,11141.25,6.25]
[null,65200,0.25,12481.25,6.25,65200,0.15,8942.5,3.75,65200,0.25,11147.5,6.25]
[null,65225,0.25,12487.5,6.25,65225,0.15,8946.25,3.75,65225,0.25,11153.75,6.25]
[null,65250,0.25,12493.75,6.25,65250,0.15,8950,3.75,65250,0.25,11160,6.25]
[null,65275,0.25,12500,6.25,65275,0.15,8953.75,3.75,65275,0.25,11166.25,6.25]
[null,65300,0.25,12506.25,6.25,65300,0.15,8957.5,3.75,65300,0.25,11172.5,6.25]
[null,65325,0.25,12512.5,6.25,65325,0.15,8961.25,3.75,65325,0.25,11178.75,6.25]
[null,65350,0.25,12518.75,6.25,65350,0.15,8965,3.75,65350,0.25,11185,6.25]
[null,65375,0.25,12525,6.25,65375,0.15,8968.75,3.75,65375,0.25,11191.25,6.25]
[null,65400,0.25,12531.25,6.25,65400,0.15,8972.5,3.75,65400,0.25,11197.5,6.25]
[null,65425,0.25,12537.5,6.25,65425,0.15,8976.25,3.75,65425,0.25,11203.75,6.25]
[null,65450,0.25,12543.75,6.25,65450,0.15,8980,3.75,65450,0.25,11210,6.25]
[null,65475,0.25,12550,6.25,65475,0.15,8983.75,3.75,65475,0.25,11216.25,6.25]
[null,65500,0.25,12556.25,6.25,65500,0.15,8987.5,3.75,65500,0.25,11222.5,6.25]
[null,65525,0.25,12562.5,6.25,65525,0.15,8991.25,3.75,65525,0.25,11228.75,6.25]
[null,65550,0.25,12568.75,6.25,65550,0.15,8995,3.75,65550,0.25,11235,6.25]
[null,65575,0.25,12575,6.25,65575,0.15,8998.75,3.75,65575,0.25,11241.25,6.25]
[null,65600,0.25,12581.25,6.25,65600,0.15,9002.5,3.75,65600,0.25,11247.5,6.25]
[null,65625,0.25,12587.5,6.25,65625,0.15,9006.25,{"$f":"+H2634-H2633","v":3.75},65625,0.25,11253.75,{"$f":"+L2634-L2633","v":6.25}]
[null,65650,0.25,12593.75,6.25,65650,0.15,9010,3.75,65650,0.25,11260,6.25]
[null,65675,0.25,12600,6.25,65675,0.15,9013.75,3.75,65675,0.25,11266.25,6.25]
[null,65700,0.25,12606.25,6.25,65700,0.15,9017.5,3.75,65700,0.25,11272.5,6.25]
[null,65725,0.25,12612.5,6.25,65725,0.15,9021.25,3.75,65725,0.25,11278.75,6.25]
[null,65750,0.25,12618.75,6.25,65750,0.15,9025,3.75,65750,0.25,11285,6.25]
[null,65775,0.25,12625,6.25,65775,0.15,9028.75,3.75,65775,0.25,11291.25,6.25]
[null,65800,0.25,12631.25,6.25,65800,0.15,9032.5,3.75,65800,0.25,11297.5,6.25]
[null,65825,0.25,12637.5,6.25,65825,0.15,9036.25,3.75,65825,0.25,11303.75,6.25]
[null,65850,0.25,12643.75,6.25,65850,0.15,9040,3.75,65850,0.25,11310,6.25]
[null,65875,0.25,12650,6.25,65875,0.15,9043.75,3.75,65875,0.25,11316.25,6.25]
[null,65900,0.25,12656.25,6.25,65900,0.15,9047.5,3.75,65900,0.25,11322.5,6.25]
[null,65925,0.25,12662.5,6.25,65925,0.15,9051.25,3.75,65925,0.25,11328.75,6.25]
[null,65950,0.25,12668.75,6.25,65950,0.15,9055,3.75,65950,0.25,11335,6.25]
[null,65975,0.25,12675,6.25,65975,0.15,9058.75,3.75,65975,0.25,11341.25,6.25]
[null,66000,0.25,12681.25,6.25,66000,0.15,9062.5,3.75,66000,0.25,11347.5,6.25]
[null,66025,0.25,{"$f":"+(B2650-34000)*C2650+$D$1369","v":12687.5},6.25,66025,0.15,9066.25,3.75,66025,0.25,11353.75,6.25]
[null,66050,0.25,12693.75,6.25,66050,0.15,9070,3.75,66050,0.25,11360,6.25]
[null,66075,0.25,12700,6.25,66075,0.15,9073.75,3.75,66075,0.25,11366.25,6.25]
[null,66100,0.25,12706.25,6.25,66100,0.15,9077.5,3.75,66100,0.25,11372.5,6.25]
[null,66125,0.25,12712.5,6.25,66125,0.15,9081.25,3.75,66125,0.25,11378.75,6.25]
[null,66150,0.25,12718.75,6.25,66150,0.15,9085,3.75,66150,0.25,11385,6.25]
[null,66175,0.25,12725,6.25,66175,0.15,9088.75,3.75,66175,0.25,11391.25,6.25]
[null,66200,0.25,12731.25,6.25,66200,0.15,9092.5,3.75,66200,0.25,11397.5,6.25]
[null,66225,0.25,12737.5,6.25,66225,0.15,9096.25,3.75,66225,0.25,11403.75,6.25]
[null,66250,0.25,12743.75,6.25,66250,0.15,9100,3.75,66250,0.25,11410,6.25]
[null,66275,0.25,12750,6.25,66275,0.15,9103.75,3.75,66275,0.25,11416.25,6.25]
[null,66300,0.25,12756.25,6.25,66300,0.15,9107.5,3.75,66300,0.25,11422.5,6.25]
[null,66325,0.25,12762.5,6.25,66325,0.15,9111.25,3.75,66325,0.25,11428.75,6.25]
[null,66350,0.25,12768.75,6.25,66350,0.15,9115,3.75,66350,0.25,11435,6.25]
[null,66375,0.25,12775,6.25,66375,0.15,{"$f":"+(F2664-16750)*G2664+$H$679","v":9118.75},3.75,66375,0.25,{"$f":"+(J2664-45550)*K2664+$L$1831","v":11441.25},6.25]
[null,66400,0.25,12781.25,6.25,66400,0.15,9122.5,3.75,66400,0.25,11447.5,6.25]
[null,66425,0.25,12787.5,6.25,66425,0.15,9126.25,3.75,66425,0.25,11453.75,6.25]
[null,66450,0.25,12793.75,6.25,66450,0.15,9130,3.75,66450,0.25,11460,6.25]
[null,66475,0.25,12800,6.25,66475,0.15,9133.75,3.75,66475,0.25,11466.25,6.25]
[null,66500,0.25,12806.25,6.25,66500,0.15,9137.5,3.75,66500,0.25,11472.5,6.25]
[null,66525,0.25,12812.5,6.25,66525,0.15,9141.25,3.75,66525,0.25,11478.75,6.25]
[null,66550,0.25,12818.75,6.25,66550,0.15,9145,3.75,66550,0.25,11485,6.25]
[null,66575,0.25,12825,6.25,66575,0.15,9148.75,3.75,66575,0.25,11491.25,6.25]
[null,66600,0.25,12831.25,6.25,66600,0.15,9152.5,3.75,66600,0.25,11497.5,6.25]
[null,66625,0.25,12837.5,6.25,66625,0.15,9156.25,3.75,66625,0.25,11503.75,6.25]
[null,66650,0.25,12843.75,6.25,66650,0.15,9160,3.75,66650,0.25,11510,6.25]
[null,66675,0.25,12850,6.25,66675,0.15,9163.75,3.75,66675,0.25,11516.25,6.25]
[null,66700,0.25,12856.25,{"$f":"+D2677-D2676","v":6.25},66700,0.15,9167.5,3.75,66700,0.25,11522.5,6.25]
[null,66725,0.25,12862.5,6.25,66725,0.15,9171.25,3.75,66725,0.25,11528.75,6.25]
[null,66750,0.25,12868.75,6.25,66750,0.15,9175,3.75,66750,0.25,11535,6.25]
[null,66775,0.25,12875,6.25,66775,0.15,9178.75,3.75,66775,0.25,11541.25,6.25]
[null,66800,0.25,12881.25,6.25,66800,0.15,9182.5,3.75,66800,0.25,11547.5,6.25]
[null,66825,0.25,12887.5,6.25,66825,0.15,9186.25,3.75,66825,0.25,11553.75,6.25]
[null,66850,0.25,12893.75,6.25,66850,0.15,9190,3.75,66850,0.25,11560,6.25]
[null,66875,0.25,12900,6.25,66875,0.15,9193.75,3.75,66875,0.25,11566.25,6.25]
[null,66900,0.25,12906.25,6.25,66900,0.15,9197.5,3.75,66900,0.25,11572.5,6.25]
[null,66925,0.25,12912.5,6.25,66925,0.15,9201.25,3.75,66925,0.25,11578.75,6.25]
[null,66950,0.25,12918.75,6.25,66950,0.15,9205,3.75,66950,0.25,11585,6.25]
[null,66975,0.25,12925,6.25,66975,0.15,9208.75,3.75,66975,0.25,11591.25,6.25]
[null,67000,0.25,12931.25,6.25,67000,0.15,9212.5,3.75,67000,0.25,11597.5,6.25]
[null,67025,0.25,12937.5,6.25,67025,0.15,9216.25,3.75,67025,0.25,11603.75,6.25]
[null,67050,0.25,12943.75,6.25,67050,0.15,9220,3.75,67050,0.25,11610,6.25]
[null,67075,0.25,12950,6.25,67075,0.15,9223.75,3.75,67075,0.25,11616.25,6.25]
[null,67100,0.25,12956.25,6.25,67100,0.15,9227.5,3.75,67100,0.25,11622.5,6.25]
[null,67125,0.25,12962.5,6.25,67125,0.15,9231.25,3.75,67125,0.25,11628.75,6.25]
[null,67150,0.25,12968.75,6.25,67150,0.15,9235,3.75,67150,0.25,11635,6.25]
[null,67175,0.25,12975,6.25,67175,0.15,9238.75,3.75,67175,0.25,11641.25,6.25]
[null,67200,0.25,12981.25,6.25,67200,0.15,9242.5,3.75,67200,0.25,11647.5,6.25]
[null,67225,0.25,12987.5,6.25,67225,0.15,9246.25,{"$f":"+H2698-H2697","v":3.75},67225,0.25,11653.75,{"$f":"+L2698-L2697","v":6.25}]
[null,67250,0.25,12993.75,6.25,67250,0.15,9250,3.75,67250,0.25,11660,6.25]
[null,67275,0.25,13000,6.25,67275,0.15,9253.75,3.75,67275,0.25,11666.25,6.25]
[null,67300,0.25,13006.25,6.25,67300,0.15,9257.5,3.75,67300,0.25,11672.5,6.25]
[null,67325,0.25,13012.5,6.25,67325,0.15,9261.25,3.75,67325,0.25,11678.75,6.25]
[null,67350,0.25,13018.75,6.25,67350,0.15,9265,3.75,67350,0.25,11685,6.25]
[null,67375,0.25,13025,6.25,67375,0.15,9268.75,3.75,67375,0.25,11691.25,6.25]
[null,67400,0.25,13031.25,6.25,67400,0.15,9272.5,3.75,67400,0.25,11697.5,6.25]
[null,67425,0.25,13037.5,6.25,67425,0.15,9276.25,3.75,67425,0.25,11703.75,6.25]
[null,67450,0.25,13043.75,6.25,67450,0.15,9280,3.75,67450,0.25,11710,6.25]
[null,67475,0.25,13050,6.25,67475,0.15,9283.75,3.75,67475,0.25,11716.25,6.25]
[null,67500,0.25,13056.25,6.25,67500,0.15,9287.5,3.75,67500,0.25,11722.5,6.25]
[null,67525,0.25,13062.5,6.25,67525,0.15,9291.25,3.75,67525,0.25,11728.75,6.25]
[null,67550,0.25,13068.75,6.25,67550,0.15,9295,3.75,67550,0.25,11735,6.25]
[null,67575,0.25,13075,6.25,67575,0.15,9298.75,3.75,67575,0.25,11741.25,6.25]
[null,67600,0.25,13081.25,6.25,67600,0.15,9302.5,3.75,67600,0.25,11747.5,6.25]
[null,67625,0.25,{"$f":"+(B2714-34000)*C2714+$D$1369","v":13087.5},6.25,67625,0.15,9306.25,3.75,67625,0.25,11753.75,6.25]
[null,67650,0.25,13093.75,6.25,67650,0.15,9310,3.75,67650,0.25,11760,6.25]
[null,67675,0.25,13100,6.25,67675,0.15,9313.75,3.75,67675,0.25,11766.25,6.25]
[null,67700,0.25,13106.25,6.25,67700,0.15,9317.5,3.75,67700,0.25,11772.5,6.25]
[null,67725,0.25,13112.5,6.25,67725,0.15,9321.25,3.75,67725,0.25,11778.75,6.25]
[null,67750,0.25,13118.75,6.25,67750,0.15,9325,3.75,67750,0.25,11785,6.25]
[null,67775,0.25,13125,6.25,67775,0.15,9328.75,3.75,67775,0.25,11791.25,6.25]
[null,67800,0.25,13131.25,6.25,67800,0.15,9332.5,3.75,67800,0.25,11797.5,6.25]
[null,67825,0.25,13137.5,6.25,67825,0.15,9336.25,3.75,67825,0.25,11803.75,6.25]
[null,67850,0.25,13143.75,6.25,67850,0.15,9340,3.75,67850,0.25,11810,6.25]
[null,67875,0.25,13150,6.25,67875,0.15,9343.75,3.75,67875,0.25,11816.25,6.25]
[null,67900,0.25,13156.25,6.25,67900,0.15,9347.5,3.75,67900,0.25,11822.5,6.25]
[null,67925,0.25,13162.5,6.25,67925,0.15,9351.25,3.75,67925,0.25,11828.75,6.25]
[null,67950,0.25,13168.75,6.25,67950,0.15,9355,3.75,67950,0.25,11835,6.25]
[null,67975,0.25,13175,6.25,67975,0.15,{"$f":"+(F2728-16750)*G2728+$H$679","v":9358.75},3.75,67975,0.25,{"$f":"+(J2728-45550)*K2728+$L$1831","v":11841.25},6.25]
[null,68000,0.25,13181.25,6.25,68000,0.15,{"$f":"+(F2729-16750)*G2729+$H$679","v":9362.5},3.75,68000,0.25,11847.5,6.25]
[null,68025,0.25,13187.5,6.25,68025,0.25,{"$f":"(F2730-68000)*G2730+$H$2729","v":9368.75},6.25,68025,0.25,11853.75,6.25]
[null,68050,0.25,13193.75,6.25,68050,0.25,9375,6.25,68050,0.25,11860,6.25]
[null,68075,0.25,13200,6.25,68075,0.25,9381.25,6.25,68075,0.25,11866.25,6.25]
[null,68100,0.25,13206.25,6.25,68100,0.25,9387.5,6.25,68100,0.25,11872.5,6.25]
[null,68125,0.25,13212.5,6.25,68125,0.25,9393.75,6.25,68125,0.25,11878.75,6.25]
[null,68150,0.25,13218.75,6.25,68150,0.25,9400,6.25,68150,0.25,11885,6.25]
[null,68175,0.25,13225,6.25,68175,0.25,9406.25,6.25,68175,0.25,11891.25,6.25]
[null,68200,0.25,13231.25,6.25,68200,0.25,9412.5,6.25,68200,0.25,11897.5,6.25]
[null,68225,0.25,13237.5,6.25,68225,0.25,9418.75,6.25,68225,0.25,11903.75,6.25]
[null,68250,0.25,13243.75,6.25,68250,0.25,9425,6.25,68250,0.25,11910,6.25]
[null,68275,0.25,13250,6.25,68275,0.25,9431.25,6.25,68275,0.25,11916.25,6.25]
[null,68300,0.25,13256.25,{"$f":"+D2741-D2740","v":6.25},68300,0.25,9437.5,6.25,68300,0.25,11922.5,6.25]
[null,68325,0.25,13262.5,6.25,68325,0.25,9443.75,6.25,68325,0.25,11928.75,6.25]
[null,68350,0.25,13268.75,6.25,68350,0.25,9450,6.25,68350,0.25,11935,6.25]
[null,68375,0.25,13275,6.25,68375,0.25,9456.25,6.25,68375,0.25,11941.25,6.25]
[null,68400,0.25,13281.25,6.25,68400,0.25,9462.5,6.25,68400,0.25,11947.5,6.25]
[null,68425,0.25,13287.5,6.25,68425,0.25,9468.75,6.25,68425,0.25,11953.75,6.25]
[null,68450,0.25,13293.75,6.25,68450,0.25,9475,6.25,68450,0.25,11960,6.25]
[null,68475,0.25,13300,6.25,68475,0.25,9481.25,6.25,68475,0.25,11966.25,6.25]
[null,68500,0.25,13306.25,6.25,68500,0.25,9487.5,6.25,68500,0.25,11972.5,6.25]
[null,68525,0.25,13312.5,6.25,68525,0.25,9493.75,6.25,68525,0.25,11978.75,6.25]
[null,68550,0.25,13318.75,6.25,68550,0.25,9500,6.25,68550,0.25,11985,6.25]
[null,68575,0.25,13325,6.25,68575,0.25,9506.25,6.25,68575,0.25,11991.25,6.25]
[null,68600,0.25,13331.25,6.25,68600,0.25,9512.5,6.25,68600,0.25,11997.5,6.25]
[null,68625,0.25,13337.5,6.25,68625,0.25,9518.75,6.25,68625,0.25,12003.75,6.25]
[null,68650,0.25,13343.75,6.25,68650,0.25,9525,6.25,68650,0.25,12010,6.25]
[null,68675,0.25,13350,6.25,68675,0.25,9531.25,6.25,68675,0.25,12016.25,6.25]
[null,68700,0.25,13356.25,6.25,68700,0.25,9537.5,6.25,68700,0.25,12022.5,6.25]
[null,68725,0.25,13362.5,6.25,68725,0.25,9543.75,6.25,68725,0.25,12028.75,6.25]
[null,68750,0.25,13368.75,6.25,68750,0.25,9550,6.25,68750,0.25,12035,6.25]
[null,68775,0.25,13375,6.25,68775,0.25,9556.25,6.25,68775,0.25,12041.25,6.25]
[null,68800,0.25,13381.25,6.25,68800,0.25,9562.5,6.25,68800,0.25,12047.5,6.25]
[null,68825,0.25,13387.5,6.25,68825,0.25,9568.75,{"$f":"+H2762-H2761","v":6.25},68825,0.25,12053.75,{"$f":"+L2762-L2761","v":6.25}]
[null,68850,0.25,13393.75,6.25,68850,0.25,9575,6.25,68850,0.25,12060,6.25]
[null,68875,0.25,13400,6.25,68875,0.25,9581.25,6.25,68875,0.25,12066.25,6.25]
[null,68900,0.25,13406.25,6.25,68900,0.25,9587.5,6.25,68900,0.25,12072.5,6.25]
[null,68925,0.25,13412.5,6.25,68925,0.25,9593.75,6.25,68925,0.25,12078.75,6.25]
[null,68950,0.25,13418.75,6.25,68950,0.25,9600,6.25,68950,0.25,12085,6.25]
[null,68975,0.25,13425,6.25,68975,0.25,9606.25,6.25,68975,0.25,12091.25,6.25]
[null,69000,0.25,13431.25,6.25,69000,0.25,9612.5,6.25,69000,0.25,12097.5,6.25]
[null,69025,0.25,13437.5,6.25,69025,0.25,9618.75,6.25,69025,0.25,12103.75,6.25]
[null,69050,0.25,13443.75,6.25,69050,0.25,9625,6.25,69050,0.25,12110,6.25]
[null,69075,0.25,13450,6.25,69075,0.25,9631.25,6.25,69075,0.25,12116.25,6.25]
[null,69100,0.25,13456.25,6.25,69100,0.25,9637.5,6.25,69100,0.25,12122.5,6.25]
[null,69125,0.25,13462.5,6.25,69125,0.25,9643.75,6.25,69125,0.25,12128.75,6.25]
[null,69150,0.25,13468.75,6.25,69150,0.25,9650,6.25,69150,0.25,12135,6.25]
[null,69175,0.25,13475,6.25,69175,0.25,9656.25,6.25,69175,0.25,12141.25,6.25]
[null,69200,0.25,13481.25,6.25,69200,0.25,9662.5,6.25,69200,0.25,12147.5,6.25]
[null,69225,0.25,{"$f":"+(B2778-34000)*C2778+$D$1369","v":13487.5},6.25,69225,0.25,9668.75,6.25,69225,0.25,12153.75,6.25]
[null,69250,0.25,13493.75,6.25,69250,0.25,9675,6.25,69250,0.25,12160,6.25]
[null,69275,0.25,13500,6.25,69275,0.25,9681.25,6.25,69275,0.25,12166.25,6.25]
[null,69300,0.25,13506.25,6.25,69300,0.25,9687.5,6.25,69300,0.25,12172.5,6.25]
[null,69325,0.25,13512.5,6.25,69325,0.25,9693.75,6.25,69325,0.25,12178.75,6.25]
[null,69350,0.25,13518.75,6.25,69350,0.25,9700,6.25,69350,0.25,12185,6.25]
[null,69375,0.25,13525,6.25,69375,0.25,9706.25,6.25,69375,0.25,12191.25,6.25]
[null,69400,0.25,13531.25,6.25,69400,0.25,9712.5,6.25,69400,0.25,12197.5,6.25]
[null,69425,0.25,13537.5,6.25,69425,0.25,9718.75,6.25,69425,0.25,12203.75,6.25]
[null,69450,0.25,13543.75,6.25,69450,0.25,9725,6.25,69450,0.25,12210,6.25]
[null,69475,0.25,13550,6.25,69475,0.25,9731.25,6.25,69475,0.25,12216.25,6.25]
[null,69500,0.25,13556.25,6.25,69500,0.25,9737.5,6.25,69500,0.25,12222.5,6.25]
[null,69525,0.25,13562.5,6.25,69525,0.25,9743.75,6.25,69525,0.25,12228.75,6.25]
[null,69550,0.25,13568.75,6.25,69550,0.25,9750,6.25,69550,0.25,12235,6.25]
[null,69575,0.25,13575,6.25,69575,0.25,9756.25,6.25,69575,0.25,{"$f":"+(J2792-45550)*K2792+$L$1831","v":12241.25},6.25]
[null,69600,0.25,13581.25,6.25,69600,0.25,9762.5,6.25,69600,0.25,12247.5,6.25]
[null,69625,0.25,13587.5,6.25,69625,0.25,{"$f":"(F2794-68000)*G2794+$H$2729","v":9768.75},6.25,69625,0.25,12253.75,6.25]
[null,69650,0.25,13593.75,6.25,69650,0.25,9775,6.25,69650,0.25,12260,6.25]
[null,69675,0.25,13600,6.25,69675,0.25,9781.25,6.25,69675,0.25,12266.25,6.25]
[null,69700,0.25,13606.25,6.25,69700,0.25,9787.5,6.25,69700,0.25,12272.5,6.25]
[null,69725,0.25,13612.5,6.25,69725,0.25,9793.75,6.25,69725,0.25,12278.75,6.25]
[null,69750,0.25,13618.75,6.25,69750,0.25,9800,6.25,69750,0.25,12285,6.25]
[null,69775,0.25,13625,6.25,69775,0.25,9806.25,6.25,69775,0.25,12291.25,6.25]
[null,69800,0.25,13631.25,6.25,69800,0.25,9812.5,6.25,69800,0.25,12297.5,6.25]
[null,69825,0.25,13637.5,6.25,69825,0.25,9818.75,6.25,69825,0.25,12303.75,6.25]
[null,69850,0.25,13643.75,6.25,69850,0.25,9825,6.25,69850,0.25,12310,6.25]
[null,69875,0.25,13650,6.25,69875,0.25,9831.25,6.25,69875,0.25,12316.25,6.25]
[null,69900,0.25,13656.25,{"$f":"+D2805-D2804","v":6.25},69900,0.25,9837.5,6.25,69900,0.25,12322.5,6.25]
[null,69925,0.25,13662.5,6.25,69925,0.25,9843.75,6.25,69925,0.25,12328.75,6.25]
[null,69950,0.25,13668.75,6.25,69950,0.25,9850,6.25,69950,0.25,12335,6.25]
[null,69975,0.25,13675,6.25,69975,0.25,9856.25,6.25,69975,0.25,12341.25,6.25]
[null,70000,0.25,13681.25,6.25,70000,0.25,9862.5,6.25,70000,0.25,12347.5,6.25]
[null,70025,0.25,13687.5,6.25,70025,0.25,9868.75,6.25,70025,0.25,12353.75,6.25]
[null,70050,0.25,13693.75,6.25,70050,0.25,9875,6.25,70050,0.25,12360,6.25]
[null,70075,0.25,13700,6.25,70075,0.25,9881.25,6.25,70075,0.25,12366.25,6.25]
[null,70100,0.25,13706.25,6.25,70100,0.25,9887.5,6.25,70100,0.25,12372.5,6.25]
[null,70125,0.25,13712.5,6.25,70125,0.25,9893.75,6.25,70125,0.25,12378.75,6.25]
[null,70150,0.25,13718.75,6.25,70150,0.25,9900,6.25,70150,0.25,12385,6.25]
[null,70175,0.25,13725,6.25,70175,0.25,9906.25,6.25,70175,0.25,12391.25,6.25]
[null,70200,0.25,13731.25,6.25,70200,0.25,9912.5,6.25,70200,0.25,12397.5,6.25]
[null,70225,0.25,13737.5,6.25,70225,0.25,9918.75,6.25,70225,0.25,12403.75,6.25]
[null,70250,0.25,13743.75,6.25,70250,0.25,9925,6.25,70250,0.25,12410,6.25]
[null,70275,0.25,13750,6.25,70275,0.25,9931.25,6.25,70275,0.25,12416.25,6.25]
[null,70300,0.25,13756.25,6.25,70300,0.25,9937.5,6.25,70300,0.25,12422.5,6.25]
[null,70325,0.25,13762.5,6.25,70325,0.25,9943.75,6.25,70325,0.25,12428.75,6.25]
[null,70350,0.25,13768.75,6.25,70350,0.25,9950,6.25,70350,0.25,12435,6.25]
[null,70375,0.25,13775,6.25,70375,0.25,9956.25,6.25,70375,0.25,12441.25,6.25]
[null,70400,0.25,13781.25,6.25,70400,0.25,9962.5,6.25,70400,0.25,12447.5,6.25]
[null,70425,0.25,13787.5,6.25,70425,0.25,9968.75,{"$f":"+H2826-H2825","v":6.25},70425,0.25,12453.75,{"$f":"+L2826-L2825","v":6.25}]
[null,70450,0.25,13793.75,6.25,70450,0.25,9975,6.25,70450,0.25,12460,6.25]
[null,70475,0.25,13800,6.25,70475,0.25,9981.25,6.25,70475,0.25,12466.25,6.25]
[null,70500,0.25,13806.25,6.25,70500,0.25,9987.5,6.25,70500,0.25,12472.5,6.25]
[null,70525,0.25,13812.5,6.25,70525,0.25,9993.75,6.25,70525,0.25,12478.75,6.25]
[null,70550,0.25,13818.75,6.25,70550,0.25,10000,6.25,70550,0.25,12485,6.25]
[null,70575,0.25,13825,6.25,70575,0.25,10006.25,6.25,70575,0.25,12491.25,6.25]
[null,70600,0.25,13831.25,6.25,70600,0.25,10012.5,6.25,70600,0.25,12497.5,6.25]
[null,70625,0.25,13837.5,6.25,70625,0.25,10018.75,6.25,70625,0.25,12503.75,6.25]
[null,70650,0.25,13843.75,6.25,70650,0.25,10025,6.25,70650,0.25,12510,6.25]
[null,70675,0.25,13850,6.25,70675,0.25,10031.25,6.25,70675,0.25,12516.25,6.25]
[null,70700,0.25,13856.25,6.25,70700,0.25,10037.5,6.25,70700,0.25,12522.5,6.25]
[null,70725,0.25,13862.5,6.25,70725,0.25,10043.75,6.25,70725,0.25,12528.75,6.25]
[null,70750,0.25,13868.75,6.25,70750,0.25,10050,6.25,70750,0.25,12535,6.25]
[null,70775,0.25,13875,6.25,70775,0.25,10056.25,6.25,70775,0.25,12541.25,6.25]
[null,70800,0.25,13881.25,6.25,70800,0.25,10062.5,6.25,70800,0.25,12547.5,6.25]
[null,70825,0.25,{"$f":"+(B2842-34000)*C2842+$D$1369","v":13887.5},6.25,70825,0.25,10068.75,6.25,70825,0.25,12553.75,6.25]
[null,70850,0.25,13893.75,6.25,70850,0.25,10075,6.25,70850,0.25,12560,6.25]
[null,70875,0.25,13900,6.25,70875,0.25,10081.25,6.25,70875,0.25,12566.25,6.25]
[null,70900,0.25,13906.25,6.25,70900,0.25,10087.5,6.25,70900,0.25,12572.5,6.25]
[null,70925,0.25,13912.5,6.25,70925,0.25,10093.75,6.25,70925,0.25,12578.75,6.25]
[null,70950,0.25,13918.75,6.25,70950,0.25,10100,6.25,70950,0.25,12585,6.25]
[null,70975,0.25,13925,6.25,70975,0.25,10106.25,6.25,70975,0.25,12591.25,6.25]
[null,71000,0.25,13931.25,6.25,71000,0.25,10112.5,6.25,71000,0.25,12597.5,6.25]
[null,71025,0.25,13937.5,6.25,71025,0.25,10118.75,6.25,71025,0.25,12603.75,6.25]
[null,71050,0.25,13943.75,6.25,71050,0.25,10125,6.25,71050,0.25,12610,6.25]
[null,71075,0.25,13950,6.25,71075,0.25,10131.25,6.25,71075,0.25,12616.25,6.25]
[null,71100,0.25,13956.25,6.25,71100,0.25,10137.5,6.25,71100,0.25,12622.5,6.25]
[null,71125,0.25,13962.5,6.25,71125,0.25,10143.75,6.25,71125,0.25,12628.75,6.25]
[null,71150,0.25,13968.75,6.25,71150,0.25,10150,6.25,71150,0.25,12635,6.25]
[null,71175,0.25,13975,6.25,71175,0.25,10156.25,6.25,71175,0.25,{"$f":"+(J2856-45550)*K2856+$L$1831","v":12641.25},6.25]
[null,71200,0.25,13981.25,6.25,71200,0.25,10162.5,6.25,71200,0.25,12647.5,6.25]
[null,71225,0.25,13987.5,6.25,71225,0.25,{"$f":"(F2858-68000)*G2858+$H$2729","v":10168.75},6.25,71225,0.25,12653.75,6.25]
[null,71250,0.25,13993.75,6.25,71250,0.25,10175,6.25,71250,0.25,12660,6.25]
[null,71275,0.25,14000,6.25,71275,0.25,10181.25,6.25,71275,0.25,12666.25,6.25]
[null,71300,0.25,14006.25,6.25,71300,0.25,10187.5,6.25,71300,0.25,12672.5,6.25]
[null,71325,0.25,14012.5,6.25,71325,0.25,10193.75,6.25,71325,0.25,12678.75,6.25]
[null,71350,0.25,14018.75,6.25,71350,0.25,10200,6.25,71350,0.25,12685,6.25]
[null,71375,0.25,14025,6.25,71375,0.25,10206.25,6.25,71375,0.25,12691.25,6.25]
[null,71400,0.25,14031.25,6.25,71400,0.25,10212.5,6.25,71400,0.25,12697.5,6.25]
[null,71425,0.25,14037.5,6.25,71425,0.25,10218.75,6.25,71425,0.25,12703.75,6.25]
[null,71450,0.25,14043.75,6.25,71450,0.25,10225,6.25,71450,0.25,12710,6.25]
[null,71475,0.25,14050,6.25,71475,0.25,10231.25,6.25,71475,0.25,12716.25,6.25]
[null,71500,0.25,14056.25,{"$f":"+D2869-D2868","v":6.25},71500,0.25,10237.5,6.25,71500,0.25,12722.5,6.25]
[null,71525,0.25,14062.5,6.25,71525,0.25,10243.75,6.25,71525,0.25,12728.75,6.25]
[null,71550,0.25,14068.75,6.25,71550,0.25,10250,6.25,71550,0.25,12735,6.25]
[null,71575,0.25,14075,6.25,71575,0.25,10256.25,6.25,71575,0.25,12741.25,6.25]
[null,71600,0.25,14081.25,6.25,71600,0.25,10262.5,6.25,71600,0.25,12747.5,6.25]
[null,71625,0.25,14087.5,6.25,71625,0.25,10268.75,6.25,71625,0.25,12753.75,6.25]
[null,71650,0.25,14093.75,6.25,71650,0.25,10275,6.25,71650,0.25,12760,6.25]
[null,71675,0.25,14100,6.25,71675,0.25,10281.25,6.25,71675,0.25,12766.25,6.25]
[null,71700,0.25,14106.25,6.25,71700,0.25,10287.5,6.25,71700,0.25,12772.5,6.25]
[null,71725,0.25,14112.5,6.25,71725,0.25,10293.75,6.25,71725,0.25,12778.75,6.25]
[null,71750,0.25,14118.75,6.25,71750,0.25,10300,6.25,71750,0.25,12785,6.25]
[null,71775,0.25,14125,6.25,71775,0.25,10306.25,6.25,71775,0.25,12791.25,6.25]
[null,71800,0.25,14131.25,6.25,71800,0.25,10312.5,6.25,71800,0.25,12797.5,6.25]
[null,71825,0.25,14137.5,6.25,71825,0.25,10318.75,6.25,71825,0.25,12803.75,6.25]
[null,71850,0.25,14143.75,6.25,71850,0.25,10325,6.25,71850,0.25,12810,6.25]
[null,71875,0.25,14150,6.25,71875,0.25,10331.25,6.25,71875,0.25,12816.25,6.25]
[null,71900,0.25,14156.25,6.25,71900,0.25,10337.5,6.25,71900,0.25,12822.5,6.25]
[null,71925,0.25,14162.5,6.25,71925,0.25,10343.75,6.25,71925,0.25,12828.75,6.25]
[null,71950,0.25,14168.75,6.25,71950,0.25,10350,6.25,71950,0.25,12835,6.25]
[null,71975,0.25,14175,6.25,71975,0.25,10356.25,6.25,71975,0.25,12841.25,6.25]
[null,72000,0.25,14181.25,6.25,72000,0.25,10362.5,6.25,72000,0.25,12847.5,6.25]
[null,72025,0.25,14187.5,6.25,72025,0.25,10368.75,{"$f":"+H2890-H2889","v":6.25},72025,0.25,12853.75,{"$f":"+L2890-L2889","v":6.25}]
[null,72050,0.25,14193.75,6.25,72050,0.25,10375,6.25,72050,0.25,12860,6.25]
[null,72075,0.25,14200,6.25,72075,0.25,10381.25,6.25,72075,0.25,12866.25,6.25]
[null,72100,0.25,14206.25,6.25,72100,0.25,10387.5,6.25,72100,0.25,12872.5,6.25]
[null,72125,0.25,14212.5,6.25,72125,0.25,10393.75,6.25,72125,0.25,12878.75,6.25]
[null,72150,0.25,14218.75,6.25,72150,0.25,10400,6.25,72150,0.25,12885,6.25]
[null,72175,0.25,14225,6.25,72175,0.25,10406.25,6.25,72175,0.25,12891.25,6.25]
[null,72200,0.25,14231.25,6.25,72200,0.25,10412.5,6.25,72200,0.25,12897.5,6.25]
[null,72225,0.25,14237.5,6.25,72225,0.25,10418.75,6.25,72225,0.25,12903.75,6.25]
[null,72250,0.25,14243.75,6.25,72250,0.25,10425,6.25,72250,0.25,12910,6.25]
[null,72275,0.25,14250,6.25,72275,0.25,10431.25,6.25,72275,0.25,12916.25,6.25]
[null,72300,0.25,14256.25,6.25,72300,0.25,10437.5,6.25,72300,0.25,12922.5,6.25]
[null,72325,0.25,14262.5,6.25,72325,0.25,10443.75,6.25,72325,0.25,12928.75,6.25]
[null,72350,0.25,14268.75,6.25,72350,0.25,10450,6.25,72350,0.25,12935,6.25]
[null,72375,0.25,14275,6.25,72375,0.25,10456.25,6.25,72375,0.25,12941.25,6.25]
[null,72400,0.25,14281.25,6.25,72400,0.25,10462.5,6.25,72400,0.25,12947.5,6.25]
[null,72425,0.25,{"$f":"+(B2906-34000)*C2906+$D$1369","v":14287.5},6.25,72425,0.25,10468.75,6.25,72425,0.25,12953.75,6.25]
[null,72450,0.25,14293.75,6.25,72450,0.25,10475,6.25,72450,0.25,12960,6.25]
[null,72475,0.25,14300,6.25,72475,0.25,10481.25,6.25,72475,0.25,12966.25,6.25]
[null,72500,0.25,14306.25,6.25,72500,0.25,10487.5,6.25,72500,0.25,12972.5,6.25]
[null,72525,0.25,14312.5,6.25,72525,0.25,10493.75,6.25,72525,0.25,12978.75,6.25]
[null,72550,0.25,14318.75,6.25,72550,0.25,10500,6.25,72550,0.25,12985,6.25]
[null,72575,0.25,14325,6.25,72575,0.25,10506.25,6.25,72575,0.25,12991.25,6.25]
[null,72600,0.25,14331.25,6.25,72600,0.25,10512.5,6.25,72600,0.25,12997.5,6.25]
[null,72625,0.25,14337.5,6.25,72625,0.25,10518.75,6.25,72625,0.25,13003.75,6.25]
[null,72650,0.25,14343.75,6.25,72650,0.25,10525,6.25,72650,0.25,13010,6.25]
[null,72675,0.25,14350,6.25,72675,0.25,10531.25,6.25,72675,0.25,13016.25,6.25]
[null,72700,0.25,14356.25,6.25,72700,0.25,10537.5,6.25,72700,0.25,13022.5,6.25]
[null,72725,0.25,14362.5,6.25,72725,0.25,10543.75,6.25,72725,0.25,13028.75,6.25]
[null,72750,0.25,14368.75,6.25,72750,0.25,10550,6.25,72750,0.25,13035,6.25]
[null,72775,0.25,14375,6.25,72775,0.25,10556.25,6.25,72775,0.25,{"$f":"+(J2920-45550)*K2920+$L$1831","v":13041.25},6.25]
[null,72800,0.25,14381.25,6.25,72800,0.25,10562.5,6.25,72800,0.25,13047.5,6.25]
[null,72825,0.25,14387.5,6.25,72825,0.25,{"$f":"(F2922-68000)*G2922+$H$2729","v":10568.75},6.25,72825,0.25,13053.75,6.25]
[null,72850,0.25,14393.75,6.25,72850,0.25,10575,6.25,72850,0.25,13060,6.25]
[null,72875,0.25,14400,6.25,72875,0.25,10581.25,6.25,72875,0.25,13066.25,6.25]
[null,72900,0.25,14406.25,6.25,72900,0.25,10587.5,6.25,72900,0.25,13072.5,6.25]
[null,72925,0.25,14412.5,6.25,72925,0.25,10593.75,6.25,72925,0.25,13078.75,6.25]
[null,72950,0.25,14418.75,6.25,72950,0.25,10600,6.25,72950,0.25,13085,6.25]
[null,72975,0.25,14425,6.25,72975,0.25,10606.25,6.25,72975,0.25,13091.25,6.25]
[null,73000,0.25,14431.25,6.25,73000,0.25,10612.5,6.25,73000,0.25,13097.5,6.25]
[null,73025,0.25,14437.5,6.25,73025,0.25,10618.75,6.25,73025,0.25,13103.75,6.25]
[null,73050,0.25,14443.75,6.25,73050,0.25,10625,6.25,73050,0.25,13110,6.25]
[null,73075,0.25,14450,6.25,73075,0.25,10631.25,6.25,73075,0.25,13116.25,6.25]
[null,73100,0.25,14456.25,{"$f":"+D2933-D2932","v":6.25},73100,0.25,10637.5,6.25,73100,0.25,13122.5,6.25]
[null,73125,0.25,14462.5,6.25,73125,0.25,10643.75,6.25,73125,0.25,13128.75,6.25]
[null,73150,0.25,14468.75,6.25,73150,0.25,10650,6.25,73150,0.25,13135,6.25]
[null,73175,0.25,14475,6.25,73175,0.25,10656.25,6.25,73175,0.25,13141.25,6.25]
[null,73200,0.25,14481.25,6.25,73200,0.25,10662.5,6.25,73200,0.25,13147.5,6.25]
[null,73225,0.25,14487.5,6.25,73225,0.25,10668.75,6.25,73225,0.25,13153.75,6.25]
[null,73250,0.25,14493.75,6.25,73250,0.25,10675,6.25,73250,0.25,13160,6.25]
[null,73275,0.25,14500,6.25,73275,0.25,10681.25,6.25,73275,0.25,13166.25,6.25]
[null,73300,0.25,14506.25,6.25,73300,0.25,10687.5,6.25,73300,0.25,13172.5,6.25]
[null,73325,0.25,14512.5,6.25,73325,0.25,10693.75,6.25,73325,0.25,13178.75,6.25]
[null,73350,0.25,14518.75,6.25,73350,0.25,10700,6.25,73350,0.25,13185,6.25]
[null,73375,0.25,14525,6.25,73375,0.25,10706.25,6.25,73375,0.25,13191.25,6.25]
[null,73400,0.25,14531.25,6.25,73400,0.25,10712.5,6.25,73400,0.25,13197.5,6.25]
[null,73425,0.25,14537.5,6.25,73425,0.25,10718.75,6.25,73425,0.25,13203.75,6.25]
[null,73450,0.25,14543.75,6.25,73450,0.25,10725,6.25,73450,0.25,13210,6.25]
[null,73475,0.25,14550,6.25,73475,0.25,10731.25,6.25,73475,0.25,13216.25,6.25]
[null,73500,0.25,14556.25,6.25,73500,0.25,10737.5,6.25,73500,0.25,13222.5,6.25]
[null,73525,0.25,14562.5,6.25,73525,0.25,10743.75,6.25,73525,0.25,13228.75,6.25]
[null,73550,0.25,14568.75,6.25,73550,0.25,10750,6.25,73550,0.25,13235,6.25]
[null,73575,0.25,14575,6.25,73575,0.25,10756.25,6.25,73575,0.25,13241.25,6.25]
[null,73600,0.25,14581.25,6.25,73600,0.25,10762.5,6.25,73600,0.25,13247.5,6.25]
[null,73625,0.25,14587.5,6.25,73625,0.25,10768.75,{"$f":"+H2954-H2953","v":6.25},73625,0.25,13253.75,{"$f":"+L2954-L2953","v":6.25}]
[null,73650,0.25,14593.75,6.25,73650,0.25,10775,6.25,73650,0.25,13260,6.25]
[null,73675,0.25,14600,6.25,73675,0.25,10781.25,6.25,73675,0.25,13266.25,6.25]
[null,73700,0.25,14606.25,6.25,73700,0.25,10787.5,6.25,73700,0.25,13272.5,6.25]
[null,73725,0.25,14612.5,6.25,73725,0.25,10793.75,6.25,73725,0.25,13278.75,6.25]
[null,73750,0.25,14618.75,6.25,73750,0.25,10800,6.25,73750,0.25,13285,6.25]
[null,73775,0.25,14625,6.25,73775,0.25,10806.25,6.25,73775,0.25,13291.25,6.25]
[null,73800,0.25,14631.25,6.25,73800,0.25,10812.5,6.25,73800,0.25,13297.5,6.25]
[null,73825,0.25,14637.5,6.25,73825,0.25,10818.75,6.25,73825,0.25,13303.75,6.25]
[null,73850,0.25,14643.75,6.25,73850,0.25,10825,6.25,73850,0.25,13310,6.25]
[null,73875,0.25,14650,6.25,73875,0.25,10831.25,6.25,73875,0.25,13316.25,6.25]
[null,73900,0.25,14656.25,6.25,73900,0.25,10837.5,6.25,73900,0.25,13322.5,6.25]
[null,73925,0.25,14662.5,6.25,73925,0.25,10843.75,6.25,73925,0.25,13328.75,6.25]
[null,73950,0.25,14668.75,6.25,73950,0.25,10850,6.25,73950,0.25,13335,6.25]
[null,73975,0.25,14675,6.25,73975,0.25,10856.25,6.25,73975,0.25,13341.25,6.25]
[null,74000,0.25,14681.25,6.25,74000,0.25,10862.5,6.25,74000,0.25,13347.5,6.25]
[null,74025,0.25,{"$f":"+(B2970-34000)*C2970+$D$1369","v":14687.5},6.25,74025,0.25,10868.75,6.25,74025,0.25,13353.75,6.25]
[null,74050,0.25,14693.75,6.25,74050,0.25,10875,6.25,74050,0.25,13360,6.25]
[null,74075,0.25,14700,6.25,74075,0.25,10881.25,6.25,74075,0.25,13366.25,6.25]
[null,74100,0.25,14706.25,6.25,74100,0.25,10887.5,6.25,74100,0.25,13372.5,6.25]
[null,74125,0.25,14712.5,6.25,74125,0.25,10893.75,6.25,74125,0.25,13378.75,6.25]
[null,74150,0.25,14718.75,6.25,74150,0.25,10900,6.25,74150,0.25,13385,6.25]
[null,74175,0.25,14725,6.25,74175,0.25,10906.25,6.25,74175,0.25,13391.25,6.25]
[null,74200,0.25,14731.25,6.25,74200,0.25,10912.5,6.25,74200,0.25,13397.5,6.25]
[null,74225,0.25,14737.5,6.25,74225,0.25,10918.75,6.25,74225,0.25,13403.75,6.25]
[null,74250,0.25,14743.75,6.25,74250,0.25,10925,6.25,74250,0.25,13410,6.25]
[null,74275,0.25,14750,6.25,74275,0.25,10931.25,6.25,74275,0.25,13416.25,6.25]
[null,74300,0.25,14756.25,6.25,74300,0.25,10937.5,6.25,74300,0.25,13422.5,6.25]
[null,74325,0.25,14762.5,6.25,74325,0.25,10943.75,6.25,74325,0.25,13428.75,6.25]
[null,74350,0.25,14768.75,6.25,74350,0.25,10950,6.25,74350,0.25,13435,6.25]
[null,74375,0.25,14775,6.25,74375,0.25,10956.25,6.25,74375,0.25,{"$f":"+(J2984-45550)*K2984+$L$1831","v":13441.25},6.25]
[null,74400,0.25,14781.25,6.25,74400,0.25,10962.5,6.25,74400,0.25,13447.5,6.25]
[null,74425,0.25,14787.5,6.25,74425,0.25,{"$f":"(F2986-68000)*G2986+$H$2729","v":10968.75},6.25,74425,0.25,13453.75,6.25]
[null,74450,0.25,14793.75,6.25,74450,0.25,10975,6.25,74450,0.25,13460,6.25]
[null,74475,0.25,14800,6.25,74475,0.25,10981.25,6.25,74475,0.25,13466.25,6.25]
[null,74500,0.25,14806.25,6.25,74500,0.25,10987.5,6.25,74500,0.25,13472.5,6.25]
[null,74525,0.25,14812.5,6.25,74525,0.25,10993.75,6.25,74525,0.25,13478.75,6.25]
[null,74550,0.25,14818.75,6.25,74550,0.25,11000,6.25,74550,0.25,13485,6.25]
[null,74575,0.25,14825,6.25,74575,0.25,11006.25,6.25,74575,0.25,13491.25,6.25]
[null,74600,0.25,14831.25,6.25,74600,0.25,11012.5,6.25,74600,0.25,13497.5,6.25]
[null,74625,0.25,14837.5,6.25,74625,0.25,11018.75,6.25,74625,0.25,13503.75,6.25]
[null,74650,0.25,14843.75,6.25,74650,0.25,11025,6.25,74650,0.25,13510,6.25]
[null,74675,0.25,14850,6.25,74675,0.25,11031.25,6.25,74675,0.25,13516.25,6.25]
[null,74700,0.25,14856.25,{"$f":"+D2997-D2996","v":6.25},74700,0.25,11037.5,6.25,74700,0.25,13522.5,6.25]
[null,74725,0.25,14862.5,6.25,74725,0.25,11043.75,6.25,74725,0.25,13528.75,6.25]
[null,74750,0.25,14868.75,6.25,74750,0.25,11050,6.25,74750,0.25,13535,6.25]
[null,74775,0.25,14875,6.25,74775,0.25,11056.25,6.25,74775,0.25,13541.25,6.25]
[null,74800,0.25,14881.25,6.25,74800,0.25,11062.5,6.25,74800,0.25,13547.5,6.25]
[null,74825,0.25,14887.5,6.25,74825,0.25,11068.75,6.25,74825,0.25,13553.75,6.25]
[null,74850,0.25,14893.75,6.25,74850,0.25,11075,6.25,74850,0.25,13560,6.25]
[null,74875,0.25,14900,6.25,74875,0.25,11081.25,6.25,74875,0.25,13566.25,6.25]
[null,74900,0.25,14906.25,6.25,74900,0.25,11087.5,6.25,74900,0.25,13572.5,6.25]
[null,74925,0.25,14912.5,6.25,74925,0.25,11093.75,6.25,74925,0.25,13578.75,6.25]
[null,74950,0.25,14918.75,6.25,74950,0.25,11100,6.25,74950,0.25,13585,6.25]
[null,74975,0.25,14925,6.25,74975,0.25,11106.25,6.25,74975,0.25,13591.25,6.25]
[null,75000,0.25,14931.25,6.25,75000,0.25,11112.5,6.25,75000,0.25,13597.5,6.25]
[null,75025,0.25,14937.5,6.25,75025,0.25,11118.75,6.25,75025,0.25,13603.75,6.25]
[null,75050,0.25,14943.75,6.25,75050,0.25,11125,6.25,75050,0.25,13610,6.25]
[null,75075,0.25,14950,6.25,75075,0.25,11131.25,6.25,75075,0.25,13616.25,6.25]
[null,75100,0.25,14956.25,6.25,75100,0.25,11137.5,6.25,75100,0.25,13622.5,6.25]
[null,75125,0.25,14962.5,6.25,75125,0.25,11143.75,6.25,75125,0.25,13628.75,6.25]
[null,75150,0.25,14968.75,6.25,75150,0.25,11150,6.25,75150,0.25,13635,6.25]
[null,75175,0.25,14975,6.25,75175,0.25,11156.25,6.25,75175,0.25,13641.25,6.25]
[null,75200,0.25,14981.25,6.25,75200,0.25,11162.5,6.25,75200,0.25,13647.5,6.25]
[null,75225,0.25,14987.5,6.25,75225,0.25,11168.75,{"$f":"+H3018-H3017","v":6.25},75225,0.25,13653.75,{"$f":"+L3018-L3017","v":6.25}]
[null,75250,0.25,14993.75,6.25,75250,0.25,11175,6.25,75250,0.25,13660,6.25]
[null,75275,0.25,15000,6.25,75275,0.25,11181.25,6.25,75275,0.25,13666.25,6.25]
[null,75300,0.25,15006.25,6.25,75300,0.25,11187.5,6.25,75300,0.25,13672.5,6.25]
[null,75325,0.25,15012.5,6.25,75325,0.25,11193.75,6.25,75325,0.25,13678.75,6.25]
[null,75350,0.25,15018.75,6.25,75350,0.25,11200,6.25,75350,0.25,13685,6.25]
[null,75375,0.25,15025,6.25,75375,0.25,11206.25,6.25,75375,0.25,13691.25,6.25]
[null,75400,0.25,15031.25,6.25,75400,0.25,11212.5,6.25,75400,0.25,13697.5,6.25]
[null,75425,0.25,15037.5,6.25,75425,0.25,11218.75,6.25,75425,0.25,13703.75,6.25]
[null,75450,0.25,15043.75,6.25,75450,0.25,11225,6.25,75450,0.25,13710,6.25]
[null,75475,0.25,15050,6.25,75475,0.25,11231.25,6.25,75475,0.25,13716.25,6.25]
[null,75500,0.25,15056.25,6.25,75500,0.25,11237.5,6.25,75500,0.25,13722.5,6.25]
[null,75525,0.25,15062.5,6.25,75525,0.25,11243.75,6.25,75525,0.25,13728.75,6.25]
[null,75550,0.25,15068.75,6.25,75550,0.25,11250,6.25,75550,0.25,13735,6.25]
[null,75575,0.25,15075,6.25,75575,0.25,11256.25,6.25,75575,0.25,13741.25,6.25]
[null,75600,0.25,15081.25,6.25,75600,0.25,11262.5,6.25,75600,0.25,13747.5,6.25]
[null,75625,0.25,{"$f":"+(B3034-34000)*C3034+$D$1369","v":15087.5},6.25,75625,0.25,11268.75,6.25,75625,0.25,13753.75,6.25]
[null,75650,0.25,15093.75,6.25,75650,0.25,11275,6.25,75650,0.25,13760,6.25]
[null,75675,0.25,15100,6.25,75675,0.25,11281.25,6.25,75675,0.25,13766.25,6.25]
[null,75700,0.25,15106.25,6.25,75700,0.25,11287.5,6.25,75700,0.25,13772.5,6.25]
[null,75725,0.25,15112.5,6.25,75725,0.25,11293.75,6.25,75725,0.25,13778.75,6.25]
[null,75750,0.25,15118.75,6.25,75750,0.25,11300,6.25,75750,0.25,13785,6.25]
[null,75775,0.25,15125,6.25,75775,0.25,11306.25,6.25,75775,0.25,13791.25,6.25]
[null,75800,0.25,15131.25,6.25,75800,0.25,11312.5,6.25,75800,0.25,13797.5,6.25]
[null,75825,0.25,15137.5,6.25,75825,0.25,11318.75,6.25,75825,0.25,13803.75,6.25]
[null,75850,0.25,15143.75,6.25,75850,0.25,11325,6.25,75850,0.25,13810,6.25]
[null,75875,0.25,15150,6.25,75875,0.25,11331.25,6.25,75875,0.25,13816.25,6.25]
[null,75900,0.25,15156.25,6.25,75900,0.25,11337.5,6.25,75900,0.25,13822.5,6.25]
[null,75925,0.25,15162.5,6.25,75925,0.25,11343.75,6.25,75925,0.25,13828.75,6.25]
[null,75950,0.25,15168.75,6.25,75950,0.25,11350,6.25,75950,0.25,13835,6.25]
[null,75975,0.25,15175,6.25,75975,0.25,11356.25,6.25,75975,0.25,{"$f":"+(J3048-45550)*K3048+$L$1831","v":13841.25},6.25]
[null,76000,0.25,15181.25,6.25,76000,0.25,11362.5,6.25,76000,0.25,13847.5,6.25]
[null,76025,0.25,15187.5,6.25,76025,0.25,{"$f":"(F3050-68000)*G3050+$H$2729","v":11368.75},6.25,76025,0.25,13853.75,6.25]
[null,76050,0.25,15193.75,6.25,76050,0.25,11375,6.25,76050,0.25,13860,6.25]
[null,76075,0.25,15200,6.25,76075,0.25,11381.25,6.25,76075,0.25,13866.25,6.25]
[null,76100,0.25,15206.25,6.25,76100,0.25,11387.5,6.25,76100,0.25,13872.5,6.25]
[null,76125,0.25,15212.5,6.25,76125,0.25,11393.75,6.25,76125,0.25,13878.75,6.25]
[null,76150,0.25,15218.75,6.25,76150,0.25,11400,6.25,76150,0.25,13885,6.25]
[null,76175,0.25,15225,6.25,76175,0.25,11406.25,6.25,76175,0.25,13891.25,6.25]
[null,76200,0.25,15231.25,6.25,76200,0.25,11412.5,6.25,76200,0.25,13897.5,6.25]
[null,76225,0.25,15237.5,6.25,76225,0.25,11418.75,6.25,76225,0.25,13903.75,6.25]
[null,76250,0.25,15243.75,6.25,76250,0.25,11425,6.25,76250,0.25,13910,6.25]
[null,76275,0.25,15250,6.25,76275,0.25,11431.25,6.25,76275,0.25,13916.25,6.25]
[null,76300,0.25,15256.25,{"$f":"+D3061-D3060","v":6.25},76300,0.25,11437.5,6.25,76300,0.25,13922.5,6.25]
[null,76325,0.25,15262.5,6.25,76325,0.25,11443.75,6.25,76325,0.25,13928.75,6.25]
[null,76350,0.25,15268.75,6.25,76350,0.25,11450,6.25,76350,0.25,13935,6.25]
[null,76375,0.25,15275,6.25,76375,0.25,11456.25,6.25,76375,0.25,13941.25,6.25]
[null,76400,0.25,15281.25,6.25,76400,0.25,11462.5,6.25,76400,0.25,13947.5,6.25]
[null,76425,0.25,15287.5,6.25,76425,0.25,11468.75,6.25,76425,0.25,13953.75,6.25]
[null,76450,0.25,15293.75,6.25,76450,0.25,11475,6.25,76450,0.25,13960,6.25]
[null,76475,0.25,15300,6.25,76475,0.25,11481.25,6.25,76475,0.25,13966.25,6.25]
[null,76500,0.25,15306.25,6.25,76500,0.25,11487.5,6.25,76500,0.25,13972.5,6.25]
[null,76525,0.25,15312.5,6.25,76525,0.25,11493.75,6.25,76525,0.25,13978.75,6.25]
[null,76550,0.25,15318.75,6.25,76550,0.25,11500,6.25,76550,0.25,13985,6.25]
[null,76575,0.25,15325,6.25,76575,0.25,11506.25,6.25,76575,0.25,13991.25,6.25]
[null,76600,0.25,15331.25,6.25,76600,0.25,11512.5,6.25,76600,0.25,13997.5,6.25]
[null,76625,0.25,15337.5,6.25,76625,0.25,11518.75,6.25,76625,0.25,14003.75,6.25]
[null,76650,0.25,15343.75,6.25,76650,0.25,11525,6.25,76650,0.25,14010,6.25]
[null,76675,0.25,15350,6.25,76675,0.25,11531.25,6.25,76675,0.25,14016.25,6.25]
[null,76700,0.25,15356.25,6.25,76700,0.25,11537.5,6.25,76700,0.25,14022.5,6.25]
[null,76725,0.25,15362.5,6.25,76725,0.25,11543.75,6.25,76725,0.25,14028.75,6.25]
[null,76750,0.25,15368.75,6.25,76750,0.25,11550,6.25,76750,0.25,14035,6.25]
[null,76775,0.25,15375,6.25,76775,0.25,11556.25,6.25,76775,0.25,14041.25,6.25]
[null,76800,0.25,15381.25,6.25,76800,0.25,11562.5,6.25,76800,0.25,14047.5,6.25]
[null,76825,0.25,15387.5,6.25,76825,0.25,11568.75,{"$f":"+H3082-H3081","v":6.25},76825,0.25,14053.75,{"$f":"+L3082-L3081","v":6.25}]
[null,76850,0.25,15393.75,6.25,76850,0.25,11575,6.25,76850,0.25,14060,6.25]
[null,76875,0.25,15400,6.25,76875,0.25,11581.25,6.25,76875,0.25,14066.25,6.25]
[null,76900,0.25,15406.25,6.25,76900,0.25,11587.5,6.25,76900,0.25,14072.5,6.25]
[null,76925,0.25,15412.5,6.25,76925,0.25,11593.75,6.25,76925,0.25,14078.75,6.25]
[null,76950,0.25,15418.75,6.25,76950,0.25,11600,6.25,76950,0.25,14085,6.25]
[null,76975,0.25,15425,6.25,76975,0.25,11606.25,6.25,76975,0.25,14091.25,6.25]
[null,77000,0.25,15431.25,6.25,77000,0.25,11612.5,6.25,77000,0.25,14097.5,6.25]
[null,77025,0.25,15437.5,6.25,77025,0.25,11618.75,6.25,77025,0.25,14103.75,6.25]
[null,77050,0.25,15443.75,6.25,77050,0.25,11625,6.25,77050,0.25,14110,6.25]
[null,77075,0.25,15450,6.25,77075,0.25,11631.25,6.25,77075,0.25,14116.25,6.25]
[null,77100,0.25,15456.25,6.25,77100,0.25,11637.5,6.25,77100,0.25,14122.5,6.25]
[null,77125,0.25,15462.5,6.25,77125,0.25,11643.75,6.25,77125,0.25,14128.75,6.25]
[null,77150,0.25,15468.75,6.25,77150,0.25,11650,6.25,77150,0.25,14135,6.25]
[null,77175,0.25,15475,6.25,77175,0.25,11656.25,6.25,77175,0.25,14141.25,6.25]
[null,77200,0.25,15481.25,6.25,77200,0.25,11662.5,6.25,77200,0.25,14147.5,6.25]
[null,77225,0.25,{"$f":"+(B3098-34000)*C3098+$D$1369","v":15487.5},6.25,77225,0.25,11668.75,6.25,77225,0.25,14153.75,6.25]
[null,77250,0.25,15493.75,6.25,77250,0.25,11675,6.25,77250,0.25,14160,6.25]
[null,77275,0.25,15500,6.25,77275,0.25,11681.25,6.25,77275,0.25,14166.25,6.25]
[null,77300,0.25,15506.25,6.25,77300,0.25,11687.5,6.25,77300,0.25,14172.5,6.25]
[null,77325,0.25,15512.5,6.25,77325,0.25,11693.75,6.25,77325,0.25,14178.75,6.25]
[null,77350,0.25,15518.75,6.25,77350,0.25,11700,6.25,77350,0.25,14185,6.25]
[null,77375,0.25,15525,6.25,77375,0.25,11706.25,6.25,77375,0.25,14191.25,6.25]
[null,77400,0.25,15531.25,6.25,77400,0.25,11712.5,6.25,77400,0.25,14197.5,6.25]
[null,77425,0.25,15537.5,6.25,77425,0.25,11718.75,6.25,77425,0.25,14203.75,6.25]
[null,77450,0.25,15543.75,6.25,77450,0.25,11725,6.25,77450,0.25,14210,6.25]
[null,77475,0.25,15550,6.25,77475,0.25,11731.25,6.25,77475,0.25,14216.25,6.25]
[null,77500,0.25,15556.25,6.25,77500,0.25,11737.5,6.25,77500,0.25,14222.5,6.25]
[null,77525,0.25,15562.5,6.25,77525,0.25,11743.75,6.25,77525,0.25,14228.75,6.25]
[null,77550,0.25,15568.75,6.25,77550,0.25,11750,6.25,77550,0.25,14235,6.25]
[null,77575,0.25,15575,6.25,77575,0.25,11756.25,6.25,77575,0.25,{"$f":"+(J3112-45550)*K3112+$L$1831","v":14241.25},6.25]
[null,77600,0.25,15581.25,6.25,77600,0.25,11762.5,6.25,77600,0.25,14247.5,6.25]
[null,77625,0.25,15587.5,6.25,77625,0.25,{"$f":"(F3114-68000)*G3114+$H$2729","v":11768.75},6.25,77625,0.25,14253.75,6.25]
[null,77650,0.25,15593.75,6.25,77650,0.25,11775,6.25,77650,0.25,14260,6.25]
[null,77675,0.25,15600,6.25,77675,0.25,11781.25,6.25,77675,0.25,14266.25,6.25]
[null,77700,0.25,15606.25,6.25,77700,0.25,11787.5,6.25,77700,0.25,14272.5,6.25]
[null,77725,0.25,15612.5,6.25,77725,0.25,11793.75,6.25,77725,0.25,14278.75,6.25]
[null,77750,0.25,15618.75,6.25,77750,0.25,11800,6.25,77750,0.25,14285,6.25]
[null,77775,0.25,15625,6.25,77775,0.25,11806.25,6.25,77775,0.25,14291.25,6.25]
[null,77800,0.25,15631.25,6.25,77800,0.25,11812.5,6.25,77800,0.25,14297.5,6.25]
[null,77825,0.25,15637.5,6.25,77825,0.25,11818.75,6.25,77825,0.25,14303.75,6.25]
[null,77850,0.25,15643.75,6.25,77850,0.25,11825,6.25,77850,0.25,14310,6.25]
[null,77875,0.25,15650,6.25,77875,0.25,11831.25,6.25,77875,0.25,14316.25,6.25]
[null,77900,0.25,15656.25,{"$f":"+D3125-D3124","v":6.25},77900,0.25,11837.5,6.25,77900,0.25,14322.5,6.25]
[null,77925,0.25,15662.5,6.25,77925,0.25,11843.75,6.25,77925,0.25,14328.75,6.25]
[null,77950,0.25,15668.75,6.25,77950,0.25,11850,6.25,77950,0.25,14335,6.25]
[null,77975,0.25,15675,6.25,77975,0.25,11856.25,6.25,77975,0.25,14341.25,6.25]
[null,78000,0.25,15681.25,6.25,78000,0.25,11862.5,6.25,78000,0.25,14347.5,6.25]
[null,78025,0.25,15687.5,6.25,78025,0.25,11868.75,6.25,78025,0.25,14353.75,6.25]
[null,78050,0.25,15693.75,6.25,78050,0.25,11875,6.25,78050,0.25,14360,6.25]
[null,78075,0.25,15700,6.25,78075,0.25,11881.25,6.25,78075,0.25,14366.25,6.25]
[null,78100,0.25,15706.25,6.25,78100,0.25,11887.5,6.25,78100,0.25,14372.5,6.25]
[null,78125,0.25,15712.5,6.25,78125,0.25,11893.75,6.25,78125,0.25,14378.75,6.25]
[null,78150,0.25,15718.75,6.25,78150,0.25,11900,6.25,78150,0.25,14385,6.25]
[null,78175,0.25,15725,6.25,78175,0.25,11906.25,6.25,78175,0.25,14391.25,6.25]
[null,78200,0.25,15731.25,6.25,78200,0.25,11912.5,6.25,78200,0.25,14397.5,6.25]
[null,78225,0.25,15737.5,6.25,78225,0.25,11918.75,6.25,78225,0.25,14403.75,6.25]
[null,78250,0.25,15743.75,6.25,78250,0.25,11925,6.25,78250,0.25,14410,6.25]
[null,78275,0.25,15750,6.25,78275,0.25,11931.25,6.25,78275,0.25,14416.25,6.25]
[null,78300,0.25,15756.25,6.25,78300,0.25,11937.5,6.25,78300,0.25,14422.5,6.25]
[null,78325,0.25,15762.5,6.25,78325,0.25,11943.75,6.25,78325,0.25,14428.75,6.25]
[null,78350,0.25,15768.75,6.25,78350,0.25,11950,6.25,78350,0.25,14435,6.25]
[null,78375,0.25,15775,6.25,78375,0.25,11956.25,6.25,78375,0.25,14441.25,6.25]
[null,78400,0.25,15781.25,6.25,78400,0.25,11962.5,6.25,78400,0.25,14447.5,6.25]
[null,78425,0.25,15787.5,6.25,78425,0.25,11968.75,{"$f":"+H3146-H3145","v":6.25},78425,0.25,14453.75,{"$f":"+L3146-L3145","v":6.25}]
[null,78450,0.25,15793.75,6.25,78450,0.25,11975,6.25,78450,0.25,14460,6.25]
[null,78475,0.25,15800,6.25,78475,0.25,11981.25,6.25,78475,0.25,14466.25,6.25]
[null,78500,0.25,15806.25,6.25,78500,0.25,11987.5,6.25,78500,0.25,14472.5,6.25]
[null,78525,0.25,15812.5,6.25,78525,0.25,11993.75,6.25,78525,0.25,14478.75,6.25]
[null,78550,0.25,15818.75,6.25,78550,0.25,12000,6.25,78550,0.25,14485,6.25]
[null,78575,0.25,15825,6.25,78575,0.25,12006.25,6.25,78575,0.25,14491.25,6.25]
[null,78600,0.25,15831.25,6.25,78600,0.25,12012.5,6.25,78600,0.25,14497.5,6.25]
[null,78625,0.25,15837.5,6.25,78625,0.25,12018.75,6.25,78625,0.25,14503.75,6.25]
[null,78650,0.25,15843.75,6.25,78650,0.25,12025,6.25,78650,0.25,14510,6.25]
[null,78675,0.25,15850,6.25,78675,0.25,12031.25,6.25,78675,0.25,14516.25,6.25]
[null,78700,0.25,15856.25,6.25,78700,0.25,12037.5,6.25,78700,0.25,14522.5,6.25]
[null,78725,0.25,15862.5,6.25,78725,0.25,12043.75,6.25,78725,0.25,14528.75,6.25]
[null,78750,0.25,15868.75,6.25,78750,0.25,12050,6.25,78750,0.25,14535,6.25]
[null,78775,0.25,15875,6.25,78775,0.25,12056.25,6.25,78775,0.25,14541.25,6.25]
[null,78800,0.25,15881.25,6.25,78800,0.25,12062.5,6.25,78800,0.25,14547.5,6.25]
[null,78825,0.25,{"$f":"+(B3162-34000)*C3162+$D$1369","v":15887.5},6.25,78825,0.25,12068.75,6.25,78825,0.25,14553.75,6.25]
[null,78850,0.25,15893.75,6.25,78850,0.25,12075,6.25,78850,0.25,14560,6.25]
[null,78875,0.25,15900,6.25,78875,0.25,12081.25,6.25,78875,0.25,14566.25,6.25]
[null,78900,0.25,15906.25,6.25,78900,0.25,12087.5,6.25,78900,0.25,14572.5,6.25]
[null,78925,0.25,15912.5,6.25,78925,0.25,12093.75,6.25,78925,0.25,14578.75,6.25]
[null,78950,0.25,15918.75,6.25,78950,0.25,12100,6.25,78950,0.25,14585,6.25]
[null,78975,0.25,15925,6.25,78975,0.25,12106.25,6.25,78975,0.25,14591.25,6.25]
[null,79000,0.25,15931.25,6.25,79000,0.25,12112.5,6.25,79000,0.25,14597.5,6.25]
[null,79025,0.25,15937.5,6.25,79025,0.25,12118.75,6.25,79025,0.25,14603.75,6.25]
[null,79050,0.25,15943.75,6.25,79050,0.25,12125,6.25,79050,0.25,14610,6.25]
[null,79075,0.25,15950,6.25,79075,0.25,12131.25,6.25,79075,0.25,14616.25,6.25]
[null,79100,0.25,15956.25,6.25,79100,0.25,12137.5,6.25,79100,0.25,14622.5,6.25]
[null,79125,0.25,15962.5,6.25,79125,0.25,12143.75,6.25,79125,0.25,14628.75,6.25]
[null,79150,0.25,15968.75,6.25,79150,0.25,12150,6.25,79150,0.25,14635,6.25]
[null,79175,0.25,15975,6.25,79175,0.25,12156.25,6.25,79175,0.25,{"$f":"+(J3176-45550)*K3176+$L$1831","v":14641.25},6.25]
[null,79200,0.25,15981.25,6.25,79200,0.25,12162.5,6.25,79200,0.25,14647.5,6.25]
[null,79225,0.25,15987.5,6.25,79225,0.25,{"$f":"(F3178-68000)*G3178+$H$2729","v":12168.75},6.25,79225,0.25,14653.75,6.25]
[null,79250,0.25,15993.75,6.25,79250,0.25,12175,6.25,79250,0.25,14660,6.25]
[null,79275,0.25,16000,6.25,79275,0.25,12181.25,6.25,79275,0.25,14666.25,6.25]
[null,79300,0.25,16006.25,6.25,79300,0.25,12187.5,6.25,79300,0.25,14672.5,6.25]
[null,79325,0.25,16012.5,6.25,79325,0.25,12193.75,6.25,79325,0.25,14678.75,6.25]
[null,79350,0.25,16018.75,6.25,79350,0.25,12200,6.25,79350,0.25,14685,6.25]
[null,79375,0.25,16025,6.25,79375,0.25,12206.25,6.25,79375,0.25,14691.25,6.25]
[null,79400,0.25,16031.25,6.25,79400,0.25,12212.5,6.25,79400,0.25,14697.5,6.25]
[null,79425,0.25,16037.5,6.25,79425,0.25,12218.75,6.25,79425,0.25,14703.75,6.25]
[null,79450,0.25,16043.75,6.25,79450,0.25,12225,6.25,79450,0.25,14710,6.25]
[null,79475,0.25,16050,6.25,79475,0.25,12231.25,6.25,79475,0.25,14716.25,6.25]
[null,79500,0.25,16056.25,{"$f":"+D3189-D3188","v":6.25},79500,0.25,12237.5,6.25,79500,0.25,14722.5,6.25]
[null,79525,0.25,16062.5,6.25,79525,0.25,12243.75,6.25,79525,0.25,14728.75,6.25]
[null,79550,0.25,16068.75,6.25,79550,0.25,12250,6.25,79550,0.25,14735,6.25]
[null,79575,0.25,16075,6.25,79575,0.25,12256.25,6.25,79575,0.25,14741.25,6.25]
[null,79600,0.25,16081.25,6.25,79600,0.25,12262.5,6.25,79600,0.25,14747.5,6.25]
[null,79625,0.25,16087.5,6.25,79625,0.25,12268.75,6.25,79625,0.25,14753.75,6.25]
[null,79650,0.25,16093.75,6.25,79650,0.25,12275,6.25,79650,0.25,14760,6.25]
[null,79675,0.25,16100,6.25,79675,0.25,12281.25,6.25,79675,0.25,14766.25,6.25]
[null,79700,0.25,16106.25,6.25,79700,0.25,12287.5,6.25,79700,0.25,14772.5,6.25]
[null,79725,0.25,16112.5,6.25,79725,0.25,12293.75,6.25,79725,0.25,14778.75,6.25]
[null,79750,0.25,16118.75,6.25,79750,0.25,12300,6.25,79750,0.25,14785,6.25]
[null,79775,0.25,16125,6.25,79775,0.25,12306.25,6.25,79775,0.25,14791.25,6.25]
[null,79800,0.25,16131.25,6.25,79800,0.25,12312.5,6.25,79800,0.25,14797.5,6.25]
[null,79825,0.25,16137.5,6.25,79825,0.25,12318.75,6.25,79825,0.25,14803.75,6.25]
[null,79850,0.25,16143.75,6.25,79850,0.25,12325,6.25,79850,0.25,14810,6.25]
[null,79875,0.25,16150,6.25,79875,0.25,12331.25,6.25,79875,0.25,14816.25,6.25]
[null,79900,0.25,16156.25,6.25,79900,0.25,12337.5,6.25,79900,0.25,14822.5,6.25]
[null,79925,0.25,16162.5,6.25,79925,0.25,12343.75,6.25,79925,0.25,14828.75,6.25]
[null,79950,0.25,16168.75,6.25,79950,0.25,12350,6.25,79950,0.25,14835,6.25]
[null,79975,0.25,16175,6.25,79975,0.25,12356.25,6.25,79975,0.25,14841.25,6.25]
[null,80000,0.25,16181.25,6.25,80000,0.25,12362.5,6.25,80000,0.25,14847.5,6.25]
[null,80025,0.25,16187.5,6.25,80025,0.25,12368.75,{"$f":"+H3210-H3209","v":6.25},80025,0.25,14853.75,{"$f":"+L3210-L3209","v":6.25}]
[null,80050,0.25,16193.75,6.25,80050,0.25,12375,6.25,80050,0.25,14860,6.25]
[null,80075,0.25,16200,6.25,80075,0.25,12381.25,6.25,80075,0.25,14866.25,6.25]
[null,80100,0.25,16206.25,6.25,80100,0.25,12387.5,6.25,80100,0.25,14872.5,6.25]
[null,80125,0.25,16212.5,6.25,80125,0.25,12393.75,6.25,80125,0.25,14878.75,6.25]
[null,80150,0.25,16218.75,6.25,80150,0.25,12400,6.25,80150,0.25,14885,6.25]
[null,80175,0.25,16225,6.25,80175,0.25,12406.25,6.25,80175,0.25,14891.25,6.25]
[null,80200,0.25,16231.25,6.25,80200,0.25,12412.5,6.25,80200,0.25,14897.5,6.25]
[null,80225,0.25,16237.5,6.25,80225,0.25,12418.75,6.25,80225,0.25,14903.75,6.25]
[null,80250,0.25,16243.75,6.25,80250,0.25,12425,6.25,80250,0.25,14910,6.25]
[null,80275,0.25,16250,6.25,80275,0.25,12431.25,6.25,80275,0.25,14916.25,6.25]
[null,80300,0.25,16256.25,6.25,80300,0.25,12437.5,6.25,80300,0.25,14922.5,6.25]
[null,80325,0.25,16262.5,6.25,80325,0.25,12443.75,6.25,80325,0.25,14928.75,6.25]
[null,80350,0.25,16268.75,6.25,80350,0.25,12450,6.25,80350,0.25,14935,6.25]
[null,80375,0.25,16275,6.25,80375,0.25,12456.25,6.25,80375,0.25,14941.25,6.25]
[null,80400,0.25,16281.25,6.25,80400,0.25,12462.5,6.25,80400,0.25,14947.5,6.25]
[null,80425,0.25,{"$f":"+(B3226-34000)*C3226+$D$1369","v":16287.5},6.25,80425,0.25,12468.75,6.25,80425,0.25,14953.75,6.25]
[null,80450,0.25,16293.75,6.25,80450,0.25,12475,6.25,80450,0.25,14960,6.25]
[null,80475,0.25,16300,6.25,80475,0.25,12481.25,6.25,80475,0.25,14966.25,6.25]
[null,80500,0.25,16306.25,6.25,80500,0.25,12487.5,6.25,80500,0.25,14972.5,6.25]
[null,80525,0.25,16312.5,6.25,80525,0.25,12493.75,6.25,80525,0.25,14978.75,6.25]
[null,80550,0.25,16318.75,6.25,80550,0.25,12500,6.25,80550,0.25,14985,6.25]
[null,80575,0.25,16325,6.25,80575,0.25,12506.25,6.25,80575,0.25,14991.25,6.25]
[null,80600,0.25,16331.25,6.25,80600,0.25,12512.5,6.25,80600,0.25,14997.5,6.25]
[null,80625,0.25,16337.5,6.25,80625,0.25,12518.75,6.25,80625,0.25,15003.75,6.25]
[null,80650,0.25,16343.75,6.25,80650,0.25,12525,6.25,80650,0.25,15010,6.25]
[null,80675,0.25,16350,6.25,80675,0.25,12531.25,6.25,80675,0.25,15016.25,6.25]
[null,80700,0.25,16356.25,6.25,80700,0.25,12537.5,6.25,80700,0.25,15022.5,6.25]
[null,80725,0.25,16362.5,6.25,80725,0.25,12543.75,6.25,80725,0.25,15028.75,6.25]
[null,80750,0.25,16368.75,6.25,80750,0.25,12550,6.25,80750,0.25,15035,6.25]
[null,80775,0.25,16375,6.25,80775,0.25,12556.25,6.25,80775,0.25,{"$f":"+(J3240-45550)*K3240+$L$1831","v":15041.25},6.25]
[null,80800,0.25,16381.25,6.25,80800,0.25,12562.5,6.25,80800,0.25,15047.5,6.25]
[null,80825,0.25,16387.5,6.25,80825,0.25,{"$f":"(F3242-68000)*G3242+$H$2729","v":12568.75},6.25,80825,0.25,15053.75,6.25]
[null,80850,0.25,16393.75,6.25,80850,0.25,12575,6.25,80850,0.25,15060,6.25]
[null,80875,0.25,16400,6.25,80875,0.25,12581.25,6.25,80875,0.25,15066.25,6.25]
[null,80900,0.25,16406.25,6.25,80900,0.25,12587.5,6.25,80900,0.25,15072.5,6.25]
[null,80925,0.25,16412.5,6.25,80925,0.25,12593.75,6.25,80925,0.25,15078.75,6.25]
[null,80950,0.25,16418.75,6.25,80950,0.25,12600,6.25,80950,0.25,15085,6.25]
[null,80975,0.25,16425,6.25,80975,0.25,12606.25,6.25,80975,0.25,15091.25,6.25]
[null,81000,0.25,16431.25,6.25,81000,0.25,12612.5,6.25,81000,0.25,15097.5,6.25]
[null,81025,0.25,16437.5,6.25,81025,0.25,12618.75,6.25,81025,0.25,15103.75,6.25]
[null,81050,0.25,16443.75,6.25,81050,0.25,12625,6.25,81050,0.25,15110,6.25]
[null,81075,0.25,16450,6.25,81075,0.25,12631.25,6.25,81075,0.25,15116.25,6.25]
[null,81100,0.25,16456.25,{"$f":"+D3253-D3252","v":6.25},81100,0.25,12637.5,6.25,81100,0.25,15122.5,6.25]
[null,81125,0.25,16462.5,6.25,81125,0.25,12643.75,6.25,81125,0.25,15128.75,6.25]
[null,81150,0.25,16468.75,6.25,81150,0.25,12650,6.25,81150,0.25,15135,6.25]
[null,81175,0.25,16475,6.25,81175,0.25,12656.25,6.25,81175,0.25,15141.25,6.25]
[null,81200,0.25,16481.25,6.25,81200,0.25,12662.5,6.25,81200,0.25,15147.5,6.25]
[null,81225,0.25,16487.5,6.25,81225,0.25,12668.75,6.25,81225,0.25,15153.75,6.25]
[null,81250,0.25,16493.75,6.25,81250,0.25,12675,6.25,81250,0.25,15160,6.25]
[null,81275,0.25,16500,6.25,81275,0.25,12681.25,6.25,81275,0.25,15166.25,6.25]
[null,81300,0.25,16506.25,6.25,81300,0.25,12687.5,6.25,81300,0.25,15172.5,6.25]
[null,81325,0.25,16512.5,6.25,81325,0.25,12693.75,6.25,81325,0.25,15178.75,6.25]
[null,81350,0.25,16518.75,6.25,81350,0.25,12700,6.25,81350,0.25,15185,6.25]
[null,81375,0.25,16525,6.25,81375,0.25,12706.25,6.25,81375,0.25,15191.25,6.25]
[null,81400,0.25,16531.25,6.25,81400,0.25,12712.5,6.25,81400,0.25,15197.5,6.25]
[null,81425,0.25,16537.5,6.25,81425,0.25,12718.75,6.25,81425,0.25,15203.75,6.25]
[null,81450,0.25,16543.75,6.25,81450,0.25,12725,6.25,81450,0.25,15210,6.25]
[null,81475,0.25,16550,6.25,81475,0.25,12731.25,6.25,81475,0.25,15216.25,6.25]
[null,81500,0.25,16556.25,6.25,81500,0.25,12737.5,6.25,81500,0.25,15222.5,6.25]
[null,81525,0.25,16562.5,6.25,81525,0.25,12743.75,6.25,81525,0.25,15228.75,6.25]
[null,81550,0.25,16568.75,6.25,81550,0.25,12750,6.25,81550,0.25,15235,6.25]
[null,81575,0.25,16575,6.25,81575,0.25,12756.25,6.25,81575,0.25,15241.25,6.25]
[null,81600,0.25,16581.25,6.25,81600,0.25,12762.5,6.25,81600,0.25,15247.5,6.25]
[null,81625,0.25,16587.5,6.25,81625,0.25,12768.75,{"$f":"+H3274-H3273","v":6.25},81625,0.25,15253.75,{"$f":"+L3274-L3273","v":6.25}]
[null,81650,0.25,16593.75,6.25,81650,0.25,12775,6.25,81650,0.25,15260,6.25]
[null,81675,0.25,16600,6.25,81675,0.25,12781.25,6.25,81675,0.25,15266.25,6.25]
[null,81700,0.25,16606.25,6.25,81700,0.25,12787.5,6.25,81700,0.25,15272.5,6.25]
[null,81725,0.25,16612.5,6.25,81725,0.25,12793.75,6.25,81725,0.25,15278.75,6.25]
[null,81750,0.25,16618.75,6.25,81750,0.25,12800,6.25,81750,0.25,15285,6.25]
[null,81775,0.25,16625,6.25,81775,0.25,12806.25,6.25,81775,0.25,15291.25,6.25]
[null,81800,0.25,16631.25,6.25,81800,0.25,12812.5,6.25,81800,0.25,15297.5,6.25]
[null,81825,0.25,16637.5,6.25,81825,0.25,12818.75,6.25,81825,0.25,15303.75,6.25]
[null,81850,0.25,16643.75,6.25,81850,0.25,12825,6.25,81850,0.25,15310,6.25]
[null,81875,0.25,16650,6.25,81875,0.25,12831.25,6.25,81875,0.25,15316.25,6.25]
[null,81900,0.25,16656.25,6.25,81900,0.25,12837.5,6.25,81900,0.25,15322.5,6.25]
[null,81925,0.25,16662.5,6.25,81925,0.25,12843.75,6.25,81925,0.25,15328.75,6.25]
[null,81950,0.25,16668.75,6.25,81950,0.25,12850,6.25,81950,0.25,15335,6.25]
[null,81975,0.25,16675,6.25,81975,0.25,12856.25,6.25,81975,0.25,15341.25,6.25]
[null,82000,0.25,16681.25,6.25,82000,0.25,12862.5,6.25,82000,0.25,15347.5,6.25]
[null,82025,0.25,{"$f":"+(B3290-34000)*C3290+$D$1369","v":16687.5},6.25,82025,0.25,12868.75,6.25,82025,0.25,15353.75,6.25]
[null,82050,0.25,16693.75,6.25,82050,0.25,12875,6.25,82050,0.25,15360,6.25]
[null,82075,0.25,16700,6.25,82075,0.25,12881.25,6.25,82075,0.25,15366.25,6.25]
[null,82100,0.25,16706.25,6.25,82100,0.25,12887.5,6.25,82100,0.25,15372.5,6.25]
[null,82125,0.25,16712.5,6.25,82125,0.25,12893.75,6.25,82125,0.25,15378.75,6.25]
[null,82150,0.25,16718.75,6.25,82150,0.25,12900,6.25,82150,0.25,15385,6.25]
[null,82175,0.25,16725,6.25,82175,0.25,12906.25,6.25,82175,0.25,15391.25,6.25]
[null,82200,0.25,16731.25,6.25,82200,0.25,12912.5,6.25,82200,0.25,15397.5,6.25]
[null,82225,0.25,16737.5,6.25,82225,0.25,12918.75,6.25,82225,0.25,15403.75,6.25]
[null,82250,0.25,16743.75,6.25,82250,0.25,12925,6.25,82250,0.25,15410,6.25]
[null,82275,0.25,16750,6.25,82275,0.25,12931.25,6.25,82275,0.25,15416.25,6.25]
[null,82300,0.25,16756.25,6.25,82300,0.25,12937.5,6.25,82300,0.25,15422.5,6.25]
[null,82325,0.25,16762.5,6.25,82325,0.25,12943.75,6.25,82325,0.25,15428.75,6.25]
[null,82350,0.25,16768.75,6.25,82350,0.25,12950,6.25,82350,0.25,15435,6.25]
[null,82375,0.25,16775,6.25,82375,0.25,12956.25,6.25,82375,0.25,{"$f":"+(J3304-45550)*K3304+$L$1831","v":15441.25},6.25]
[null,82400,0.25,16781.25,6.25,82400,0.25,12962.5,6.25,82400,0.25,15447.5,6.25]
[null,82425,0.28000000000000003,{"$f":"(B3306-82400)*C3306+$D$3305","v":16788.25},7,82425,0.25,{"$f":"(F3306-68000)*G3306+$H$2729","v":12968.75},6.25,82425,0.25,15453.75,6.25]
[null,82450,0.28000000000000003,16795.25,7,82450,0.25,12975,6.25,82450,0.25,15460,6.25]
[null,82475,0.28000000000000003,16802.25,7,82475,0.25,12981.25,6.25,82475,0.25,15466.25,6.25]
[null,82500,0.28000000000000003,16809.25,7,82500,0.25,12987.5,6.25,82500,0.25,15472.5,6.25]
[null,82525,0.28000000000000003,16816.25,7,82525,0.25,12993.75,6.25,82525,0.25,15478.75,6.25]
[null,82550,0.28000000000000003,16823.25,7,82550,0.25,13000,6.25,82550,0.25,15485,6.25]
[null,82575,0.28000000000000003,16830.25,7,82575,0.25,13006.25,6.25,82575,0.25,15491.25,6.25]
[null,82600,0.28000000000000003,16837.25,7,82600,0.25,13012.5,6.25,82600,0.25,15497.5,6.25]
[null,82625,0.28000000000000003,16844.25,7,82625,0.25,13018.75,6.25,82625,0.25,15503.75,6.25]
[null,82650,0.28000000000000003,16851.25,7,82650,0.25,13025,6.25,82650,0.25,15510,6.25]
[null,82675,0.28000000000000003,16858.25,7,82675,0.25,13031.25,6.25,82675,0.25,15516.25,6.25]
[null,82700,0.28000000000000003,16865.25,{"$f":"+D3317-D3316","v":7},82700,0.25,13037.5,6.25,82700,0.25,15522.5,6.25]
[null,82725,0.28000000000000003,16872.25,7,82725,0.25,13043.75,6.25,82725,0.25,15528.75,6.25]
[null,82750,0.28000000000000003,16879.25,7,82750,0.25,13050,6.25,82750,0.25,15535,6.25]
[null,82775,0.28000000000000003,16886.25,7,82775,0.25,13056.25,6.25,82775,0.25,15541.25,6.25]
[null,82800,0.28000000000000003,16893.25,7,82800,0.25,13062.5,6.25,82800,0.25,15547.5,6.25]
[null,82825,0.28000000000000003,16900.25,7,82825,0.25,13068.75,6.25,82825,0.25,15553.75,6.25]
[null,82850,0.28000000000000003,16907.25,7,82850,0.25,13075,6.25,82850,0.25,15560,6.25]
[null,82875,0.28000000000000003,16914.25,7,82875,0.25,13081.25,6.25,82875,0.25,15566.25,6.25]
[null,82900,0.28000000000000003,16921.25,7,82900,0.25,13087.5,6.25,82900,0.25,15572.5,6.25]
[null,82925,0.28000000000000003,16928.25,7,82925,0.25,13093.75,6.25,82925,0.25,15578.75,6.25]
[null,82950,0.28000000000000003,16935.25,7,82950,0.25,13100,6.25,82950,0.25,15585,6.25]
[null,82975,0.28000000000000003,16942.25,7,82975,0.25,13106.25,6.25,82975,0.25,15591.25,6.25]
[null,83000,0.28000000000000003,16949.25,7,83000,0.25,13112.5,6.25,83000,0.25,15597.5,6.25]
[null,83025,0.28000000000000003,16956.25,7,83025,0.25,13118.75,6.25,83025,0.25,15603.75,6.25]
[null,83050,0.28000000000000003,16963.25,7,83050,0.25,13125,6.25,83050,0.25,15610,6.25]
[null,83075,0.28000000000000003,16970.25,7,83075,0.25,13131.25,6.25,83075,0.25,15616.25,6.25]
[null,83100,0.28000000000000003,16977.25,7,83100,0.25,13137.5,6.25,83100,0.25,15622.5,6.25]
[null,83125,0.28000000000000003,16984.25,7,83125,0.25,13143.75,6.25,83125,0.25,15628.75,6.25]
[null,83150,0.28000000000000003,16991.25,7,83150,0.25,13150,6.25,83150,0.25,15635,6.25]
[null,83175,0.28000000000000003,16998.25,7,83175,0.25,13156.25,6.25,83175,0.25,15641.25,6.25]
[null,83200,0.28000000000000003,17005.25,7,83200,0.25,13162.5,6.25,83200,0.25,15647.5,6.25]
[null,83225,0.28000000000000003,17012.25,7,83225,0.25,13168.75,{"$f":"+H3338-H3337","v":6.25},83225,0.25,15653.75,{"$f":"+L3338-L3337","v":6.25}]
[null,83250,0.28000000000000003,17019.25,7,83250,0.25,13175,6.25,83250,0.25,15660,6.25]
[null,83275,0.28000000000000003,17026.25,7,83275,0.25,13181.25,6.25,83275,0.25,15666.25,6.25]
[null,83300,0.28000000000000003,17033.25,7,83300,0.25,13187.5,6.25,83300,0.25,15672.5,6.25]
[null,83325,0.28000000000000003,17040.25,7,83325,0.25,13193.75,6.25,83325,0.25,15678.75,6.25]
[null,83350,0.28000000000000003,17047.25,7,83350,0.25,13200,6.25,83350,0.25,15685,6.25]
[null,83375,0.28000000000000003,17054.25,7,83375,0.25,13206.25,6.25,83375,0.25,15691.25,6.25]
[null,83400,0.28000000000000003,17061.25,7,83400,0.25,13212.5,6.25,83400,0.25,15697.5,6.25]
[null,83425,0.28000000000000003,17068.25,7,83425,0.25,13218.75,6.25,83425,0.25,15703.75,6.25]
[null,83450,0.28000000000000003,17075.25,7,83450,0.25,13225,6.25,83450,0.25,15710,6.25]
[null,83475,0.28000000000000003,17082.25,7,83475,0.25,13231.25,6.25,83475,0.25,15716.25,6.25]
[null,83500,0.28000000000000003,17089.25,7,83500,0.25,13237.5,6.25,83500,0.25,15722.5,6.25]
[null,83525,0.28000000000000003,17096.25,7,83525,0.25,13243.75,6.25,83525,0.25,15728.75,6.25]
[null,83550,0.28000000000000003,17103.25,7,83550,0.25,13250,6.25,83550,0.25,15735,6.25]
[null,83575,0.28000000000000003,17110.25,7,83575,0.25,13256.25,6.25,83575,0.25,15741.25,6.25]
[null,83600,0.28000000000000003,17117.25,7,83600,0.25,13262.5,6.25,83600,0.25,15747.5,6.25]
[null,83625,0.28000000000000003,17124.25,7,83625,0.25,13268.75,6.25,83625,0.25,15753.75,6.25]
[null,83650,0.28000000000000003,17131.25,7,83650,0.25,13275,6.25,83650,0.25,15760,6.25]
[null,83675,0.28000000000000003,17138.25,7,83675,0.25,13281.25,6.25,83675,0.25,15766.25,6.25]
[null,83700,0.28000000000000003,17145.25,7,83700,0.25,13287.5,6.25,83700,0.25,15772.5,6.25]
[null,83725,0.28000000000000003,17152.25,7,83725,0.25,13293.75,6.25,83725,0.25,15778.75,6.25]
[null,83750,0.28000000000000003,17159.25,7,83750,0.25,13300,6.25,83750,0.25,15785,6.25]
[null,83775,0.28000000000000003,17166.25,7,83775,0.25,13306.25,6.25,83775,0.25,15791.25,6.25]
[null,83800,0.28000000000000003,17173.25,7,83800,0.25,13312.5,6.25,83800,0.25,15797.5,6.25]
[null,83825,0.28000000000000003,17180.25,7,83825,0.25,13318.75,6.25,83825,0.25,15803.75,6.25]
[null,83850,0.28000000000000003,17187.25,7,83850,0.25,13325,6.25,83850,0.25,15810,6.25]
[null,83875,0.28000000000000003,17194.25,7,83875,0.25,13331.25,6.25,83875,0.25,15816.25,6.25]
[null,83900,0.28000000000000003,17201.25,7,83900,0.25,13337.5,6.25,83900,0.25,15822.5,6.25]
[null,83925,0.28000000000000003,17208.25,7,83925,0.25,13343.75,6.25,83925,0.25,15828.75,6.25]
[null,83950,0.28000000000000003,17215.25,7,83950,0.25,13350,6.25,83950,0.25,15835,6.25]
[null,83975,0.28000000000000003,17222.25,7,83975,0.25,13356.25,6.25,83975,0.25,{"$f":"+(J3368-45550)*K3368+$L$1831","v":15841.25},6.25]
[null,84000,0.28000000000000003,17229.25,7,84000,0.25,13362.5,6.25,84000,0.25,15847.5,6.25]
[null,84025,0.28000000000000003,{"$f":"(B3370-82400)*C3370+$D$3305","v":17236.25},7,84025,0.25,{"$f":"(F3370-68000)*G3370+$H$2729","v":13368.75},6.25,84025,0.25,15853.75,6.25]
[null,84050,0.28000000000000003,17243.25,7,84050,0.25,13375,6.25,84050,0.25,15860,6.25]
[null,84075,0.28000000000000003,17250.25,7,84075,0.25,13381.25,6.25,84075,0.25,15866.25,6.25]
[null,84100,0.28000000000000003,17257.25,7,84100,0.25,13387.5,6.25,84100,0.25,15872.5,6.25]
[null,84125,0.28000000000000003,17264.25,7,84125,0.25,13393.75,6.25,84125,0.25,15878.75,6.25]
[null,84150,0.28000000000000003,17271.25,7,84150,0.25,13400,6.25,84150,0.25,15885,6.25]
[null,84175,0.28000000000000003,17278.25,7,84175,0.25,13406.25,6.25,84175,0.25,15891.25,6.25]
[null,84200,0.28000000000000003,17285.25,7,84200,0.25,13412.5,6.25,84200,0.25,15897.5,6.25]
[null,84225,0.28000000000000003,17292.25,7,84225,0.25,13418.75,6.25,84225,0.25,15903.75,6.25]
[null,84250,0.28000000000000003,17299.25,7,84250,0.25,13425,6.25,84250,0.25,15910,6.25]
[null,84275,0.28000000000000003,17306.25,7,84275,0.25,13431.25,6.25,84275,0.25,15916.25,6.25]
[null,84300,0.28000000000000003,17313.25,{"$f":"+D3381-D3380","v":7},84300,0.25,13437.5,6.25,84300,0.25,15922.5,6.25]
[null,84325,0.28000000000000003,17320.25,7,84325,0.25,13443.75,6.25,84325,0.25,15928.75,6.25]
[null,84350,0.28000000000000003,17327.25,7,84350,0.25,13450,6.25,84350,0.25,15935,6.25]
[null,84375,0.28000000000000003,17334.25,7,84375,0.25,13456.25,6.25,84375,0.25,15941.25,6.25]
[null,84400,0.28000000000000003,17341.25,7,84400,0.25,13462.5,6.25,84400,0.25,15947.5,6.25]
[null,84425,0.28000000000000003,17348.25,7,84425,0.25,13468.75,6.25,84425,0.25,15953.75,6.25]
[null,84450,0.28000000000000003,17355.25,7,84450,0.25,13475,6.25,84450,0.25,15960,6.25]
[null,84475,0.28000000000000003,17362.25,7,84475,0.25,13481.25,6.25,84475,0.25,15966.25,6.25]
[null,84500,0.28000000000000003,17369.25,7,84500,0.25,13487.5,6.25,84500,0.25,15972.5,6.25]
[null,84525,0.28000000000000003,17376.25,7,84525,0.25,13493.75,6.25,84525,0.25,15978.75,6.25]
[null,84550,0.28000000000000003,17383.25,7,84550,0.25,13500,6.25,84550,0.25,15985,6.25]
[null,84575,0.28000000000000003,17390.25,7,84575,0.25,13506.25,6.25,84575,0.25,15991.25,6.25]
[null,84600,0.28000000000000003,17397.25,7,84600,0.25,13512.5,6.25,84600,0.25,15997.5,6.25]
[null,84625,0.28000000000000003,17404.25,7,84625,0.25,13518.75,6.25,84625,0.25,16003.75,6.25]
[null,84650,0.28000000000000003,17411.25,7,84650,0.25,13525,6.25,84650,0.25,16010,6.25]
[null,84675,0.28000000000000003,17418.25,7,84675,0.25,13531.25,6.25,84675,0.25,16016.25,6.25]
[null,84700,0.28000000000000003,17425.25,7,84700,0.25,13537.5,6.25,84700,0.25,16022.5,6.25]
[null,84725,0.28000000000000003,17432.25,7,84725,0.25,13543.75,6.25,84725,0.25,16028.75,6.25]
[null,84750,0.28000000000000003,17439.25,7,84750,0.25,13550,6.25,84750,0.25,16035,6.25]
[null,84775,0.28000000000000003,17446.25,7,84775,0.25,13556.25,6.25,84775,0.25,16041.25,6.25]
[null,84800,0.28000000000000003,17453.25,7,84800,0.25,13562.5,6.25,84800,0.25,16047.5,6.25]
[null,84825,0.28000000000000003,17460.25,7,84825,0.25,13568.75,{"$f":"+H3402-H3401","v":6.25},84825,0.25,16053.75,{"$f":"+L3402-L3401","v":6.25}]
[null,84850,0.28000000000000003,17467.25,7,84850,0.25,13575,6.25,84850,0.25,16060,6.25]
[null,84875,0.28000000000000003,17474.25,7,84875,0.25,13581.25,6.25,84875,0.25,16066.25,6.25]
[null,84900,0.28000000000000003,17481.25,7,84900,0.25,13587.5,6.25,84900,0.25,16072.5,6.25]
[null,84925,0.28000000000000003,17488.25,7,84925,0.25,13593.75,6.25,84925,0.25,16078.75,6.25]
[null,84950,0.28000000000000003,17495.25,7,84950,0.25,13600,6.25,84950,0.25,16085,6.25]
[null,84975,0.28000000000000003,17502.25,7,84975,0.25,13606.25,6.25,84975,0.25,16091.25,6.25]
[null,85000,0.28000000000000003,17509.25,7,85000,0.25,13612.5,6.25,85000,0.25,16097.5,6.25]
[null,85025,0.28000000000000003,17516.25,7,85025,0.25,13618.75,6.25,85025,0.25,16103.75,6.25]
[null,85050,0.28000000000000003,17523.25,7,85050,0.25,13625,6.25,85050,0.25,16110,6.25]
[null,85075,0.28000000000000003,17530.25,7,85075,0.25,13631.25,6.25,85075,0.25,16116.25,6.25]
[null,85100,0.28000000000000003,17537.25,7,85100,0.25,13637.5,6.25,85100,0.25,16122.5,6.25]
[null,85125,0.28000000000000003,17544.25,7,85125,0.25,13643.75,6.25,85125,0.25,16128.75,6.25]
[null,85150,0.28000000000000003,17551.25,7,85150,0.25,13650,6.25,85150,0.25,16135,6.25]
[null,85175,0.28000000000000003,17558.25,7,85175,0.25,13656.25,6.25,85175,0.25,16141.25,6.25]
[null,85200,0.28000000000000003,17565.25,7,85200,0.25,13662.5,6.25,85200,0.25,16147.5,6.25]
[null,85225,0.28000000000000003,17572.25,7,85225,0.25,13668.75,6.25,85225,0.25,16153.75,6.25]
[null,85250,0.28000000000000003,17579.25,7,85250,0.25,13675,6.25,85250,0.25,16160,6.25]
[null,85275,0.28000000000000003,17586.25,7,85275,0.25,13681.25,6.25,85275,0.25,16166.25,6.25]
[null,85300,0.28000000000000003,17593.25,7,85300,0.25,13687.5,6.25,85300,0.25,16172.5,6.25]
[null,85325,0.28000000000000003,17600.25,7,85325,0.25,13693.75,6.25,85325,0.25,16178.75,6.25]
[null,85350,0.28000000000000003,17607.25,7,85350,0.25,13700,6.25,85350,0.25,16185,6.25]
[null,85375,0.28000000000000003,17614.25,7,85375,0.25,13706.25,6.25,85375,0.25,16191.25,6.25]
[null,85400,0.28000000000000003,17621.25,7,85400,0.25,13712.5,6.25,85400,0.25,16197.5,6.25]
[null,85425,0.28000000000000003,17628.25,7,85425,0.25,13718.75,6.25,85425,0.25,16203.75,6.25]
[null,85450,0.28000000000000003,17635.25,7,85450,0.25,13725,6.25,85450,0.25,16210,6.25]
[null,85475,0.28000000000000003,17642.25,7,85475,0.25,13731.25,6.25,85475,0.25,16216.25,6.25]
[null,85500,0.28000000000000003,17649.25,7,85500,0.25,13737.5,6.25,85500,0.25,16222.5,6.25]
[null,85525,0.28000000000000003,17656.25,7,85525,0.25,13743.75,6.25,85525,0.25,16228.75,6.25]
[null,85550,0.28000000000000003,17663.25,7,85550,0.25,13750,6.25,85550,0.25,16235,6.25]
[null,85575,0.28000000000000003,17670.25,7,85575,0.25,13756.25,6.25,85575,0.25,{"$f":"+(J3432-45550)*K3432+$L$1831","v":16241.25},6.25]
[null,85600,0.28000000000000003,17677.25,7,85600,0.25,13762.5,6.25,85600,0.25,16247.5,6.25]
[null,85625,0.28000000000000003,{"$f":"(B3434-82400)*C3434+$D$3305","v":17684.25},7,85625,0.25,{"$f":"(F3434-68000)*G3434+$H$2729","v":13768.75},6.25,85625,0.25,16253.75,6.25]
[null,85650,0.28000000000000003,17691.25,7,85650,0.25,13775,6.25,85650,0.25,16260,6.25]
[null,85675,0.28000000000000003,17698.25,7,85675,0.25,13781.25,6.25,85675,0.25,16266.25,6.25]
[null,85700,0.28000000000000003,17705.25,7,85700,0.25,13787.5,6.25,85700,0.25,16272.5,6.25]
[null,85725,0.28000000000000003,17712.25,7,85725,0.25,13793.75,6.25,85725,0.25,16278.75,6.25]
[null,85750,0.28000000000000003,17719.25,7,85750,0.25,13800,6.25,85750,0.25,16285,6.25]
[null,85775,0.28000000000000003,17726.25,7,85775,0.25,13806.25,6.25,85775,0.25,16291.25,6.25]
[null,85800,0.28000000000000003,17733.25,7,85800,0.25,13812.5,6.25,85800,0.25,16297.5,6.25]
[null,85825,0.28000000000000003,17740.25,7,85825,0.25,13818.75,6.25,85825,0.25,16303.75,6.25]
[null,85850,0.28000000000000003,17747.25,7,85850,0.25,13825,6.25,85850,0.25,16310,6.25]
[null,85875,0.28000000000000003,17754.25,7,85875,0.25,13831.25,6.25,85875,0.25,16316.25,6.25]
[null,85900,0.28000000000000003,17761.25,{"$f":"+D3445-D3444","v":7},85900,0.25,13837.5,6.25,85900,0.25,16322.5,6.25]
[null,85925,0.28000000000000003,17768.25,7,85925,0.25,13843.75,6.25,85925,0.25,16328.75,6.25]
[null,85950,0.28000000000000003,17775.25,7,85950,0.25,13850,6.25,85950,0.25,16335,6.25]
[null,85975,0.28000000000000003,17782.25,7,85975,0.25,13856.25,6.25,85975,0.25,16341.25,6.25]
[null,86000,0.28000000000000003,17789.25,7,86000,0.25,13862.5,6.25,86000,0.25,16347.5,6.25]
[null,86025,0.28000000000000003,17796.25,7,86025,0.25,13868.75,6.25,86025,0.25,16353.75,6.25]
[null,86050,0.28000000000000003,17803.25,7,86050,0.25,13875,6.25,86050,0.25,16360,6.25]
[null,86075,0.28000000000000003,17810.25,7,86075,0.25,13881.25,6.25,86075,0.25,16366.25,6.25]
[null,86100,0.28000000000000003,17817.25,7,86100,0.25,13887.5,6.25,86100,0.25,16372.5,6.25]
[null,86125,0.28000000000000003,17824.25,7,86125,0.25,13893.75,6.25,86125,0.25,16378.75,6.25]
[null,86150,0.28000000000000003,17831.25,7,86150,0.25,13900,6.25,86150,0.25,16385,6.25]
[null,86175,0.28000000000000003,17838.25,7,86175,0.25,13906.25,6.25,86175,0.25,16391.25,6.25]
[null,86200,0.28000000000000003,17845.25,7,86200,0.25,13912.5,6.25,86200,0.25,16397.5,6.25]
[null,86225,0.28000000000000003,17852.25,7,86225,0.25,13918.75,6.25,86225,0.25,16403.75,6.25]
[null,86250,0.28000000000000003,17859.25,7,86250,0.25,13925,6.25,86250,0.25,16410,6.25]
[null,86275,0.28000000000000003,17866.25,7,86275,0.25,13931.25,6.25,86275,0.25,16416.25,6.25]
[null,86300,0.28000000000000003,17873.25,7,86300,0.25,13937.5,6.25,86300,0.25,16422.5,6.25]
[null,86325,0.28000000000000003,17880.25,7,86325,0.25,13943.75,6.25,86325,0.25,16428.75,6.25]
[null,86350,0.28000000000000003,17887.25,7,86350,0.25,13950,6.25,86350,0.25,16435,6.25]
[null,86375,0.28000000000000003,17894.25,7,86375,0.25,13956.25,6.25,86375,0.25,16441.25,6.25]
[null,86400,0.28000000000000003,17901.25,7,86400,0.25,13962.5,6.25,86400,0.25,16447.5,6.25]
[null,86425,0.28000000000000003,17908.25,7,86425,0.25,13968.75,{"$f":"+H3466-H3465","v":6.25},86425,0.25,16453.75,{"$f":"+L3466-L3465","v":6.25}]
[null,86450,0.28000000000000003,17915.25,7,86450,0.25,13975,6.25,86450,0.25,16460,6.25]
[null,86475,0.28000000000000003,17922.25,7,86475,0.25,13981.25,6.25,86475,0.25,16466.25,6.25]
[null,86500,0.28000000000000003,17929.25,7,86500,0.25,13987.5,6.25,86500,0.25,16472.5,6.25]
[null,86525,0.28000000000000003,17936.25,7,86525,0.25,13993.75,6.25,86525,0.25,16478.75,6.25]
[null,86550,0.28000000000000003,17943.25,7,86550,0.25,14000,6.25,86550,0.25,16485,6.25]
[null,86575,0.28000000000000003,17950.25,7,86575,0.25,14006.25,6.25,86575,0.25,16491.25,6.25]
[null,86600,0.28000000000000003,17957.25,7,86600,0.25,14012.5,6.25,86600,0.25,16497.5,6.25]
[null,86625,0.28000000000000003,17964.25,7,86625,0.25,14018.75,6.25,86625,0.25,16503.75,6.25]
[null,86650,0.28000000000000003,17971.25,7,86650,0.25,14025,6.25,86650,0.25,16510,6.25]
[null,86675,0.28000000000000003,17978.25,7,86675,0.25,14031.25,6.25,86675,0.25,16516.25,6.25]
[null,86700,0.28000000000000003,17985.25,7,86700,0.25,14037.5,6.25,86700,0.25,16522.5,6.25]
[null,86725,0.28000000000000003,17992.25,7,86725,0.25,14043.75,6.25,86725,0.25,16528.75,6.25]
[null,86750,0.28000000000000003,17999.25,7,86750,0.25,14050,6.25,86750,0.25,16535,6.25]
[null,86775,0.28000000000000003,18006.25,7,86775,0.25,14056.25,6.25,86775,0.25,16541.25,6.25]
[null,86800,0.28000000000000003,18013.25,7,86800,0.25,14062.5,6.25,86800,0.25,16547.5,6.25]
[null,86825,0.28000000000000003,18020.25,7,86825,0.25,14068.75,6.25,86825,0.25,16553.75,6.25]
[null,86850,0.28000000000000003,18027.25,7,86850,0.25,14075,6.25,86850,0.25,16560,6.25]
[null,86875,0.28000000000000003,18034.25,7,86875,0.25,14081.25,6.25,86875,0.25,16566.25,6.25]
[null,86900,0.28000000000000003,18041.25,7,86900,0.25,14087.5,6.25,86900,0.25,16572.5,6.25]
[null,86925,0.28000000000000003,18048.25,7,86925,0.25,14093.75,6.25,86925,0.25,16578.75,6.25]
[null,86950,0.28000000000000003,18055.25,7,86950,0.25,14100,6.25,86950,0.25,16585,6.25]
[null,86975,0.28000000000000003,18062.25,7,86975,0.25,14106.25,6.25,86975,0.25,16591.25,6.25]
[null,87000,0.28000000000000003,18069.25,7,87000,0.25,14112.5,6.25,87000,0.25,16597.5,6.25]
[null,87025,0.28000000000000003,18076.25,7,87025,0.25,14118.75,6.25,87025,0.25,16603.75,6.25]
[null,87050,0.28000000000000003,18083.25,7,87050,0.25,14125,6.25,87050,0.25,16610,6.25]
[null,87075,0.28000000000000003,18090.25,7,87075,0.25,14131.25,6.25,87075,0.25,16616.25,6.25]
[null,87100,0.28000000000000003,18097.25,7,87100,0.25,14137.5,6.25,87100,0.25,16622.5,6.25]
[null,87125,0.28000000000000003,18104.25,7,87125,0.25,14143.75,6.25,87125,0.25,16628.75,6.25]
[null,87150,0.28000000000000003,18111.25,7,87150,0.25,14150,6.25,87150,0.25,16635,6.25]
[null,87175,0.28000000000000003,18118.25,7,87175,0.25,14156.25,6.25,87175,0.25,{"$f":"+(J3496-45550)*K3496+$L$1831","v":16641.25},6.25]
[null,87200,0.28000000000000003,18125.25,7,87200,0.25,14162.5,6.25,87200,0.25,16647.5,6.25]
[null,87225,0.28000000000000003,{"$f":"(B3498-82400)*C3498+$D$3305","v":18132.25},7,87225,0.25,{"$f":"(F3498-68000)*G3498+$H$2729","v":14168.75},6.25,87225,0.25,16653.75,6.25]
[null,87250,0.28000000000000003,18139.25,7,87250,0.25,14175,6.25,87250,0.25,16660,6.25]
[null,87275,0.28000000000000003,18146.25,7,87275,0.25,14181.25,6.25,87275,0.25,16666.25,6.25]
[null,87300,0.28000000000000003,18153.25,7,87300,0.25,14187.5,6.25,87300,0.25,16672.5,6.25]
[null,87325,0.28000000000000003,18160.25,7,87325,0.25,14193.75,6.25,87325,0.25,16678.75,6.25]
[null,87350,0.28000000000000003,18167.25,7,87350,0.25,14200,6.25,87350,0.25,16685,6.25]
[null,87375,0.28000000000000003,18174.25,7,87375,0.25,14206.25,6.25,87375,0.25,16691.25,6.25]
[null,87400,0.28000000000000003,18181.25,7,87400,0.25,14212.5,6.25,87400,0.25,16697.5,6.25]
[null,87425,0.28000000000000003,18188.25,7,87425,0.25,14218.75,6.25,87425,0.25,16703.75,6.25]
[null,87450,0.28000000000000003,18195.25,7,87450,0.25,14225,6.25,87450,0.25,16710,6.25]
[null,87475,0.28000000000000003,18202.25,7,87475,0.25,14231.25,6.25,87475,0.25,16716.25,6.25]
[null,87500,0.28000000000000003,18209.25,{"$f":"+D3509-D3508","v":7},87500,0.25,14237.5,6.25,87500,0.25,16722.5,6.25]
[null,87525,0.28000000000000003,18216.25,7,87525,0.25,14243.75,6.25,87525,0.25,16728.75,6.25]
[null,87550,0.28000000000000003,18223.25,7,87550,0.25,14250,6.25,87550,0.25,16735,6.25]
[null,87575,0.28000000000000003,18230.25,7,87575,0.25,14256.25,6.25,87575,0.25,16741.25,6.25]
[null,87600,0.28000000000000003,18237.25,7,87600,0.25,14262.5,6.25,87600,0.25,16747.5,6.25]
[null,87625,0.28000000000000003,18244.25,7,87625,0.25,14268.75,6.25,87625,0.25,16753.75,6.25]
[null,87650,0.28000000000000003,18251.25,7,87650,0.25,14275,6.25,87650,0.25,16760,6.25]
[null,87675,0.28000000000000003,18258.25,7,87675,0.25,14281.25,6.25,87675,0.25,16766.25,6.25]
[null,87700,0.28000000000000003,18265.25,7,87700,0.25,14287.5,6.25,87700,0.25,16772.5,6.25]
[null,87725,0.28000000000000003,18272.25,7,87725,0.25,14293.75,6.25,87725,0.25,16778.75,6.25]
[null,87750,0.28000000000000003,18279.25,7,87750,0.25,14300,6.25,87750,0.25,16785,6.25]
[null,87775,0.28000000000000003,18286.25,7,87775,0.25,14306.25,6.25,87775,0.25,16791.25,6.25]
[null,87800,0.28000000000000003,18293.25,7,87800,0.25,14312.5,6.25,87800,0.25,16797.5,6.25]
[null,87825,0.28000000000000003,18300.25,7,87825,0.25,14318.75,6.25,87825,0.25,16803.75,6.25]
[null,87850,0.28000000000000003,18307.25,7,87850,0.25,14325,6.25,87850,0.25,16810,6.25]
[null,87875,0.28000000000000003,18314.25,7,87875,0.25,14331.25,6.25,87875,0.25,16816.25,6.25]
[null,87900,0.28000000000000003,18321.25,7,87900,0.25,14337.5,6.25,87900,0.25,16822.5,6.25]
[null,87925,0.28000000000000003,18328.25,7,87925,0.25,14343.75,6.25,87925,0.25,16828.75,6.25]
[null,87950,0.28000000000000003,18335.25,7,87950,0.25,14350,6.25,87950,0.25,16835,6.25]
[null,87975,0.28000000000000003,18342.25,7,87975,0.25,14356.25,6.25,87975,0.25,16841.25,6.25]
[null,88000,0.28000000000000003,18349.25,7,88000,0.25,14362.5,6.25,88000,0.25,16847.5,6.25]
[null,88025,0.28000000000000003,18356.25,7,88025,0.25,14368.75,{"$f":"+H3530-H3529","v":6.25},88025,0.25,16853.75,{"$f":"+L3530-L3529","v":6.25}]
[null,88050,0.28000000000000003,18363.25,7,88050,0.25,14375,6.25,88050,0.25,16860,6.25]
[null,88075,0.28000000000000003,18370.25,7,88075,0.25,14381.25,6.25,88075,0.25,16866.25,6.25]
[null,88100,0.28000000000000003,18377.25,7,88100,0.25,14387.5,6.25,88100,0.25,16872.5,6.25]
[null,88125,0.28000000000000003,18384.25,7,88125,0.25,14393.75,6.25,88125,0.25,16878.75,6.25]
[null,88150,0.28000000000000003,18391.25,7,88150,0.25,14400,6.25,88150,0.25,16885,6.25]
[null,88175,0.28000000000000003,18398.25,7,88175,0.25,14406.25,6.25,88175,0.25,16891.25,6.25]
[null,88200,0.28000000000000003,18405.25,7,88200,0.25,14412.5,6.25,88200,0.25,16897.5,6.25]
[null,88225,0.28000000000000003,18412.25,7,88225,0.25,14418.75,6.25,88225,0.25,16903.75,6.25]
[null,88250,0.28000000000000003,18419.25,7,88250,0.25,14425,6.25,88250,0.25,16910,6.25]
[null,88275,0.28000000000000003,18426.25,7,88275,0.25,14431.25,6.25,88275,0.25,16916.25,6.25]
[null,88300,0.28000000000000003,18433.25,7,88300,0.25,14437.5,6.25,88300,0.25,16922.5,6.25]
[null,88325,0.28000000000000003,18440.25,7,88325,0.25,14443.75,6.25,88325,0.25,16928.75,6.25]
[null,88350,0.28000000000000003,18447.25,7,88350,0.25,14450,6.25,88350,0.25,16935,6.25]
[null,88375,0.28000000000000003,18454.25,7,88375,0.25,14456.25,6.25,88375,0.25,16941.25,6.25]
[null,88400,0.28000000000000003,18461.25,7,88400,0.25,14462.5,6.25,88400,0.25,16947.5,6.25]
[null,88425,0.28000000000000003,18468.25,7,88425,0.25,14468.75,6.25,88425,0.25,16953.75,6.25]
[null,88450,0.28000000000000003,18475.25,7,88450,0.25,14475,6.25,88450,0.25,16960,6.25]
[null,88475,0.28000000000000003,18482.25,7,88475,0.25,14481.25,6.25,88475,0.25,16966.25,6.25]
[null,88500,0.28000000000000003,18489.25,7,88500,0.25,14487.5,6.25,88500,0.25,16972.5,6.25]
[null,88525,0.28000000000000003,18496.25,7,88525,0.25,14493.75,6.25,88525,0.25,16978.75,6.25]
[null,88550,0.28000000000000003,18503.25,7,88550,0.25,14500,6.25,88550,0.25,16985,6.25]
[null,88575,0.28000000000000003,18510.25,7,88575,0.25,14506.25,6.25,88575,0.25,16991.25,6.25]
[null,88600,0.28000000000000003,18517.25,7,88600,0.25,14512.5,6.25,88600,0.25,16997.5,6.25]
[null,88625,0.28000000000000003,18524.25,7,88625,0.25,14518.75,6.25,88625,0.25,17003.75,6.25]
[null,88650,0.28000000000000003,18531.25,7,88650,0.25,14525,6.25,88650,0.25,17010,6.25]
[null,88675,0.28000000000000003,18538.25,7,88675,0.25,14531.25,6.25,88675,0.25,17016.25,6.25]
[null,88700,0.28000000000000003,18545.25,7,88700,0.25,14537.5,6.25,88700,0.25,17022.5,6.25]
[null,88725,0.28000000000000003,18552.25,7,88725,0.25,14543.75,6.25,88725,0.25,17028.75,6.25]
[null,88750,0.28000000000000003,18559.25,7,88750,0.25,14550,6.25,88750,0.25,17035,6.25]
[null,88775,0.28000000000000003,18566.25,7,88775,0.25,14556.25,6.25,88775,0.25,{"$f":"+(J3560-45550)*K3560+$L$1831","v":17041.25},6.25]
[null,88800,0.28000000000000003,18573.25,7,88800,0.25,14562.5,6.25,88800,0.25,17047.5,6.25]
[null,88825,0.28000000000000003,{"$f":"(B3562-82400)*C3562+$D$3305","v":18580.25},7,88825,0.25,{"$f":"(F3562-68000)*G3562+$H$2729","v":14568.75},6.25,88825,0.25,17053.75,6.25]
[null,88850,0.28000000000000003,18587.25,7,88850,0.25,14575,6.25,88850,0.25,17060,6.25]
[null,88875,0.28000000000000003,18594.25,7,88875,0.25,14581.25,6.25,88875,0.25,17066.25,6.25]
[null,88900,0.28000000000000003,18601.25,7,88900,0.25,14587.5,6.25,88900,0.25,17072.5,6.25]
[null,88925,0.28000000000000003,18608.25,7,88925,0.25,14593.75,6.25,88925,0.25,17078.75,6.25]
[null,88950,0.28000000000000003,18615.25,7,88950,0.25,14600,6.25,88950,0.25,17085,6.25]
[null,88975,0.28000000000000003,18622.25,7,88975,0.25,14606.25,6.25,88975,0.25,17091.25,6.25]
[null,89000,0.28000000000000003,18629.25,7,89000,0.25,14612.5,6.25,89000,0.25,17097.5,6.25]
[null,89025,0.28000000000000003,18636.25,7,89025,0.25,14618.75,6.25,89025,0.25,17103.75,6.25]
[null,89050,0.28000000000000003,18643.25,7,89050,0.25,14625,6.25,89050,0.25,17110,6.25]
[null,89075,0.28000000000000003,18650.25,7,89075,0.25,14631.25,6.25,89075,0.25,17116.25,6.25]
[null,89100,0.28000000000000003,18657.25,{"$f":"+D3573-D3572","v":7},89100,0.25,14637.5,6.25,89100,0.25,17122.5,6.25]
[null,89125,0.28000000000000003,18664.25,7,89125,0.25,14643.75,6.25,89125,0.25,17128.75,6.25]
[null,89150,0.28000000000000003,18671.25,7,89150,0.25,14650,6.25,89150,0.25,17135,6.25]
[null,89175,0.28000000000000003,18678.25,7,89175,0.25,14656.25,6.25,89175,0.25,17141.25,6.25]
[null,89200,0.28000000000000003,18685.25,7,89200,0.25,14662.5,6.25,89200,0.25,17147.5,6.25]
[null,89225,0.28000000000000003,18692.25,7,89225,0.25,14668.75,6.25,89225,0.25,17153.75,6.25]
[null,89250,0.28000000000000003,18699.25,7,89250,0.25,14675,6.25,89250,0.25,17160,6.25]
[null,89275,0.28000000000000003,18706.25,7,89275,0.25,14681.25,6.25,89275,0.25,17166.25,6.25]
[null,89300,0.28000000000000003,18713.25,7,89300,0.25,14687.5,6.25,89300,0.25,17172.5,6.25]
[null,89325,0.28000000000000003,18720.25,7,89325,0.25,14693.75,6.25,89325,0.25,17178.75,6.25]
[null,89350,0.28000000000000003,18727.25,7,89350,0.25,14700,6.25,89350,0.25,17185,6.25]
[null,89375,0.28000000000000003,18734.25,7,89375,0.25,14706.25,6.25,89375,0.25,17191.25,6.25]
[null,89400,0.28000000000000003,18741.25,7,89400,0.25,14712.5,6.25,89400,0.25,17197.5,6.25]
[null,89425,0.28000000000000003,18748.25,7,89425,0.25,14718.75,6.25,89425,0.25,17203.75,6.25]
[null,89450,0.28000000000000003,18755.25,7,89450,0.25,14725,6.25,89450,0.25,17210,6.25]
[null,89475,0.28000000000000003,18762.25,7,89475,0.25,14731.25,6.25,89475,0.25,17216.25,6.25]
[null,89500,0.28000000000000003,18769.25,7,89500,0.25,14737.5,6.25,89500,0.25,17222.5,6.25]
[null,89525,0.28000000000000003,18776.25,7,89525,0.25,14743.75,6.25,89525,0.25,17228.75,6.25]
[null,89550,0.28000000000000003,18783.25,7,89550,0.25,14750,6.25,89550,0.25,17235,6.25]
[null,89575,0.28000000000000003,18790.25,7,89575,0.25,14756.25,6.25,89575,0.25,17241.25,6.25]
[null,89600,0.28000000000000003,18797.25,7,89600,0.25,14762.5,6.25,89600,0.25,17247.5,6.25]
[null,89625,0.28000000000000003,18804.25,7,89625,0.25,14768.75,{"$f":"+H3594-H3593","v":6.25},89625,0.25,17253.75,{"$f":"+L3594-L3593","v":6.25}]
[null,89650,0.28000000000000003,18811.25,7,89650,0.25,14775,6.25,89650,0.25,17260,6.25]
[null,89675,0.28000000000000003,18818.25,7,89675,0.25,14781.25,6.25,89675,0.25,17266.25,6.25]
[null,89700,0.28000000000000003,18825.25,7,89700,0.25,14787.5,6.25,89700,0.25,17272.5,6.25]
[null,89725,0.28000000000000003,18832.25,7,89725,0.25,14793.75,6.25,89725,0.25,17278.75,6.25]
[null,89750,0.28000000000000003,18839.25,7,89750,0.25,14800,6.25,89750,0.25,17285,6.25]
[null,89775,0.28000000000000003,18846.25,7,89775,0.25,14806.25,6.25,89775,0.25,17291.25,6.25]
[null,89800,0.28000000000000003,18853.25,7,89800,0.25,14812.5,6.25,89800,0.25,17297.5,6.25]
[null,89825,0.28000000000000003,18860.25,7,89825,0.25,14818.75,6.25,89825,0.25,17303.75,6.25]
[null,89850,0.28000000000000003,18867.25,7,89850,0.25,14825,6.25,89850,0.25,17310,6.25]
[null,89875,0.28000000000000003,18874.25,7,89875,0.25,14831.25,6.25,89875,0.25,17316.25,6.25]
[null,89900,0.28000000000000003,18881.25,7,89900,0.25,14837.5,6.25,89900,0.25,17322.5,6.25]
[null,89925,0.28000000000000003,18888.25,7,89925,0.25,14843.75,6.25,89925,0.25,17328.75,6.25]
[null,89950,0.28000000000000003,18895.25,7,89950,0.25,14850,6.25,89950,0.25,17335,6.25]
[null,89975,0.28000000000000003,18902.25,7,89975,0.25,14856.25,6.25,89975,0.25,17341.25,6.25]
[null,90000,0.28000000000000003,18909.25,7,90000,0.25,14862.5,6.25,90000,0.25,17347.5,6.25]
[null,90025,0.28000000000000003,18916.25,7,90025,0.25,14868.75,6.25,90025,0.25,17353.75,6.25]
[null,90050,0.28000000000000003,18923.25,7,90050,0.25,14875,6.25,90050,0.25,17360,6.25]
[null,90075,0.28000000000000003,18930.25,7,90075,0.25,14881.25,6.25,90075,0.25,17366.25,6.25]
[null,90100,0.28000000000000003,18937.25,7,90100,0.25,14887.5,6.25,90100,0.25,17372.5,6.25]
[null,90125,0.28000000000000003,18944.25,7,90125,0.25,14893.75,6.25,90125,0.25,17378.75,6.25]
[null,90150,0.28000000000000003,18951.25,7,90150,0.25,14900,6.25,90150,0.25,17385,6.25]
[null,90175,0.28000000000000003,18958.25,7,90175,0.25,14906.25,6.25,90175,0.25,17391.25,6.25]
[null,90200,0.28000000000000003,18965.25,7,90200,0.25,14912.5,6.25,90200,0.25,17397.5,6.25]
[null,90225,0.28000000000000003,18972.25,7,90225,0.25,14918.75,6.25,90225,0.25,17403.75,6.25]
[null,90250,0.28000000000000003,18979.25,7,90250,0.25,14925,6.25,90250,0.25,17410,6.25]
[null,90275,0.28000000000000003,18986.25,7,90275,0.25,14931.25,6.25,90275,0.25,17416.25,6.25]
[null,90300,0.28000000000000003,18993.25,7,90300,0.25,14937.5,6.25,90300,0.25,17422.5,6.25]
[null,90325,0.28000000000000003,19000.25,7,90325,0.25,14943.75,6.25,90325,0.25,17428.75,6.25]
[null,90350,0.28000000000000003,19007.25,7,90350,0.25,14950,6.25,90350,0.25,17435,6.25]
[null,90375,0.28000000000000003,19014.25,7,90375,0.25,14956.25,6.25,90375,0.25,{"$f":"+(J3624-45550)*K3624+$L$1831","v":17441.25},6.25]
[null,90400,0.28000000000000003,19021.25,7,90400,0.25,14962.5,6.25,90400,0.25,17447.5,6.25]
[null,90425,0.28000000000000003,{"$f":"(B3626-82400)*C3626+$D$3305","v":19028.25},7,90425,0.25,{"$f":"(F3626-68000)*G3626+$H$2729","v":14968.75},6.25,90425,0.25,17453.75,6.25]
[null,90450,0.28000000000000003,19035.25,7,90450,0.25,14975,6.25,90450,0.25,17460,6.25]
[null,90475,0.28000000000000003,19042.25,7,90475,0.25,14981.25,6.25,90475,0.25,17466.25,6.25]
[null,90500,0.28000000000000003,19049.25,7,90500,0.25,14987.5,6.25,90500,0.25,17472.5,6.25]
[null,90525,0.28000000000000003,19056.25,7,90525,0.25,14993.75,6.25,90525,0.25,17478.75,6.25]
[null,90550,0.28000000000000003,19063.25,7,90550,0.25,15000,6.25,90550,0.25,17485,6.25]
[null,90575,0.28000000000000003,19070.25,7,90575,0.25,15006.25,6.25,90575,0.25,17491.25,6.25]
[null,90600,0.28000000000000003,19077.25,7,90600,0.25,15012.5,6.25,90600,0.25,17497.5,6.25]
[null,90625,0.28000000000000003,19084.25,7,90625,0.25,15018.75,6.25,90625,0.25,17503.75,6.25]
[null,90650,0.28000000000000003,19091.25,7,90650,0.25,15025,6.25,90650,0.25,17510,6.25]
[null,90675,0.28000000000000003,19098.25,7,90675,0.25,15031.25,6.25,90675,0.25,17516.25,6.25]
[null,90700,0.28000000000000003,19105.25,{"$f":"+D3637-D3636","v":7},90700,0.25,15037.5,6.25,90700,0.25,17522.5,6.25]
[null,90725,0.28000000000000003,19112.25,7,90725,0.25,15043.75,6.25,90725,0.25,17528.75,6.25]
[null,90750,0.28000000000000003,19119.25,7,90750,0.25,15050,6.25,90750,0.25,17535,6.25]
[null,90775,0.28000000000000003,19126.25,7,90775,0.25,15056.25,6.25,90775,0.25,17541.25,6.25]
[null,90800,0.28000000000000003,19133.25,7,90800,0.25,15062.5,6.25,90800,0.25,17547.5,6.25]
[null,90825,0.28000000000000003,19140.25,7,90825,0.25,15068.75,6.25,90825,0.25,17553.75,6.25]
[null,90850,0.28000000000000003,19147.25,7,90850,0.25,15075,6.25,90850,0.25,17560,6.25]
[null,90875,0.28000000000000003,19154.25,7,90875,0.25,15081.25,6.25,90875,0.25,17566.25,6.25]
[null,90900,0.28000000000000003,19161.25,7,90900,0.25,15087.5,6.25,90900,0.25,17572.5,6.25]
[null,90925,0.28000000000000003,19168.25,7,90925,0.25,15093.75,6.25,90925,0.25,17578.75,6.25]
[null,90950,0.28000000000000003,19175.25,7,90950,0.25,15100,6.25,90950,0.25,17585,6.25]
[null,90975,0.28000000000000003,19182.25,7,90975,0.25,15106.25,6.25,90975,0.25,17591.25,6.25]
[null,91000,0.28000000000000003,19189.25,7,91000,0.25,15112.5,6.25,91000,0.25,17597.5,6.25]
[null,91025,0.28000000000000003,19196.25,7,91025,0.25,15118.75,6.25,91025,0.25,17603.75,6.25]
[null,91050,0.28000000000000003,19203.25,7,91050,0.25,15125,6.25,91050,0.25,17610,6.25]
[null,91075,0.28000000000000003,19210.25,7,91075,0.25,15131.25,6.25,91075,0.25,17616.25,6.25]
[null,91100,0.28000000000000003,19217.25,7,91100,0.25,15137.5,6.25,91100,0.25,17622.5,6.25]
[null,91125,0.28000000000000003,19224.25,7,91125,0.25,15143.75,6.25,91125,0.25,17628.75,6.25]
[null,91150,0.28000000000000003,19231.25,7,91150,0.25,15150,6.25,91150,0.25,17635,6.25]
[null,91175,0.28000000000000003,19238.25,7,91175,0.25,15156.25,6.25,91175,0.25,17641.25,6.25]
[null,91200,0.28000000000000003,19245.25,7,91200,0.25,15162.5,6.25,91200,0.25,17647.5,6.25]
[null,91225,0.28000000000000003,19252.25,7,91225,0.25,15168.75,{"$f":"+H3658-H3657","v":6.25},91225,0.25,17653.75,{"$f":"+L3658-L3657","v":6.25}]
[null,91250,0.28000000000000003,19259.25,7,91250,0.25,15175,6.25,91250,0.25,17660,6.25]
[null,91275,0.28000000000000003,19266.25,7,91275,0.25,15181.25,6.25,91275,0.25,17666.25,6.25]
[null,91300,0.28000000000000003,19273.25,7,91300,0.25,15187.5,6.25,91300,0.25,17672.5,6.25]
[null,91325,0.28000000000000003,19280.25,7,91325,0.25,15193.75,6.25,91325,0.25,17678.75,6.25]
[null,91350,0.28000000000000003,19287.25,7,91350,0.25,15200,6.25,91350,0.25,17685,6.25]
[null,91375,0.28000000000000003,19294.25,7,91375,0.25,15206.25,6.25,91375,0.25,17691.25,6.25]
[null,91400,0.28000000000000003,19301.25,7,91400,0.25,15212.5,6.25,91400,0.25,17697.5,6.25]
[null,91425,0.28000000000000003,19308.25,7,91425,0.25,15218.75,6.25,91425,0.25,17703.75,6.25]
[null,91450,0.28000000000000003,19315.25,7,91450,0.25,15225,6.25,91450,0.25,17710,6.25]
[null,91475,0.28000000000000003,19322.25,7,91475,0.25,15231.25,6.25,91475,0.25,17716.25,6.25]
[null,91500,0.28000000000000003,19329.25,7,91500,0.25,15237.5,6.25,91500,0.25,17722.5,6.25]
[null,91525,0.28000000000000003,19336.25,7,91525,0.25,15243.75,6.25,91525,0.25,17728.75,6.25]
[null,91550,0.28000000000000003,19343.25,7,91550,0.25,15250,6.25,91550,0.25,17735,6.25]
[null,91575,0.28000000000000003,19350.25,7,91575,0.25,15256.25,6.25,91575,0.25,17741.25,6.25]
[null,91600,0.28000000000000003,19357.25,7,91600,0.25,15262.5,6.25,91600,0.25,17747.5,6.25]
[null,91625,0.28000000000000003,19364.25,7,91625,0.25,15268.75,6.25,91625,0.25,17753.75,6.25]
[null,91650,0.28000000000000003,19371.25,7,91650,0.25,15275,6.25,91650,0.25,17760,6.25]
[null,91675,0.28000000000000003,19378.25,7,91675,0.25,15281.25,6.25,91675,0.25,17766.25,6.25]
[null,91700,0.28000000000000003,19385.25,7,91700,0.25,15287.5,6.25,91700,0.25,17772.5,6.25]
[null,91725,0.28000000000000003,19392.25,7,91725,0.25,15293.75,6.25,91725,0.25,17778.75,6.25]
[null,91750,0.28000000000000003,19399.25,7,91750,0.25,15300,6.25,91750,0.25,17785,6.25]
[null,91775,0.28000000000000003,19406.25,7,91775,0.25,15306.25,6.25,91775,0.25,17791.25,6.25]
[null,91800,0.28000000000000003,19413.25,7,91800,0.25,15312.5,6.25,91800,0.25,17797.5,6.25]
[null,91825,0.28000000000000003,19420.25,7,91825,0.25,15318.75,6.25,91825,0.25,17803.75,6.25]
[null,91850,0.28000000000000003,19427.25,7,91850,0.25,15325,6.25,91850,0.25,17810,6.25]
[null,91875,0.28000000000000003,19434.25,7,91875,0.25,15331.25,6.25,91875,0.25,17816.25,6.25]
[null,91900,0.28000000000000003,19441.25,7,91900,0.25,15337.5,6.25,91900,0.25,17822.5,6.25]
[null,91925,0.28000000000000003,19448.25,7,91925,0.25,15343.75,6.25,91925,0.25,17828.75,6.25]
[null,91950,0.28000000000000003,19455.25,7,91950,0.25,15350,6.25,91950,0.25,17835,6.25]
[null,91975,0.28000000000000003,19462.25,7,91975,0.25,15356.25,6.25,91975,0.25,{"$f":"+(J3688-45550)*K3688+$L$1831","v":17841.25},6.25]
[null,92000,0.28000000000000003,19469.25,7,92000,0.25,15362.5,6.25,92000,0.25,17847.5,6.25]
[null,92025,0.28000000000000003,{"$f":"(B3690-82400)*C3690+$D$3305","v":19476.25},7,92025,0.25,{"$f":"(F3690-68000)*G3690+$H$2729","v":15368.75},6.25,92025,0.25,17853.75,6.25]
[null,92050,0.28000000000000003,19483.25,7,92050,0.25,15375,6.25,92050,0.25,17860,6.25]
[null,92075,0.28000000000000003,19490.25,7,92075,0.25,15381.25,6.25,92075,0.25,17866.25,6.25]
[null,92100,0.28000000000000003,19497.25,7,92100,0.25,15387.5,6.25,92100,0.25,17872.5,6.25]
[null,92125,0.28000000000000003,19504.25,7,92125,0.25,15393.75,6.25,92125,0.25,17878.75,6.25]
[null,92150,0.28000000000000003,19511.25,7,92150,0.25,15400,6.25,92150,0.25,17885,6.25]
[null,92175,0.28000000000000003,19518.25,7,92175,0.25,15406.25,6.25,92175,0.25,17891.25,6.25]
[null,92200,0.28000000000000003,19525.25,7,92200,0.25,15412.5,6.25,92200,0.25,17897.5,6.25]
[null,92225,0.28000000000000003,19532.25,7,92225,0.25,15418.75,6.25,92225,0.25,17903.75,6.25]
[null,92250,0.28000000000000003,19539.25,7,92250,0.25,15425,6.25,92250,0.25,17910,6.25]
[null,92275,0.28000000000000003,19546.25,7,92275,0.25,15431.25,6.25,92275,0.25,17916.25,6.25]
[null,92300,0.28000000000000003,19553.25,{"$f":"+D3701-D3700","v":7},92300,0.25,15437.5,6.25,92300,0.25,17922.5,6.25]
[null,92325,0.28000000000000003,19560.25,7,92325,0.25,15443.75,6.25,92325,0.25,17928.75,6.25]
[null,92350,0.28000000000000003,19567.25,7,92350,0.25,15450,6.25,92350,0.25,17935,6.25]
[null,92375,0.28000000000000003,19574.25,7,92375,0.25,15456.25,6.25,92375,0.25,17941.25,6.25]
[null,92400,0.28000000000000003,19581.25,7,92400,0.25,15462.5,6.25,92400,0.25,17947.5,6.25]
[null,92425,0.28000000000000003,19588.25,7,92425,0.25,15468.75,6.25,92425,0.25,17953.75,6.25]
[null,92450,0.28000000000000003,19595.25,7,92450,0.25,15475,6.25,92450,0.25,17960,6.25]
[null,92475,0.28000000000000003,19602.25,7,92475,0.25,15481.25,6.25,92475,0.25,17966.25,6.25]
[null,92500,0.28000000000000003,19609.25,7,92500,0.25,15487.5,6.25,92500,0.25,17972.5,6.25]
[null,92525,0.28000000000000003,19616.25,7,92525,0.25,15493.75,6.25,92525,0.25,17978.75,6.25]
[null,92550,0.28000000000000003,19623.25,7,92550,0.25,15500,6.25,92550,0.25,17985,6.25]
[null,92575,0.28000000000000003,19630.25,7,92575,0.25,15506.25,6.25,92575,0.25,17991.25,6.25]
[null,92600,0.28000000000000003,19637.25,7,92600,0.25,15512.5,6.25,92600,0.25,17997.5,6.25]
[null,92625,0.28000000000000003,19644.25,7,92625,0.25,15518.75,6.25,92625,0.25,18003.75,6.25]
[null,92650,0.28000000000000003,19651.25,7,92650,0.25,15525,6.25,92650,0.25,18010,6.25]
[null,92675,0.28000000000000003,19658.25,7,92675,0.25,15531.25,6.25,92675,0.25,18016.25,6.25]
[null,92700,0.28000000000000003,19665.25,7,92700,0.25,15537.5,6.25,92700,0.25,18022.5,6.25]
[null,92725,0.28000000000000003,19672.25,7,92725,0.25,15543.75,6.25,92725,0.25,18028.75,6.25]
[null,92750,0.28000000000000003,19679.25,7,92750,0.25,15550,6.25,92750,0.25,18035,6.25]
[null,92775,0.28000000000000003,19686.25,7,92775,0.25,15556.25,6.25,92775,0.25,18041.25,6.25]
[null,92800,0.28000000000000003,19693.25,7,92800,0.25,15562.5,6.25,92800,0.25,18047.5,6.25]
[null,92825,0.28000000000000003,19700.25,7,92825,0.25,15568.75,{"$f":"+H3722-H3721","v":6.25},92825,0.25,18053.75,{"$f":"+L3722-L3721","v":6.25}]
[null,92850,0.28000000000000003,19707.25,7,92850,0.25,15575,6.25,92850,0.25,18060,6.25]
[null,92875,0.28000000000000003,19714.25,7,92875,0.25,15581.25,6.25,92875,0.25,18066.25,6.25]
[null,92900,0.28000000000000003,19721.25,7,92900,0.25,15587.5,6.25,92900,0.25,18072.5,6.25]
[null,92925,0.28000000000000003,19728.25,7,92925,0.25,15593.75,6.25,92925,0.25,18078.75,6.25]
[null,92950,0.28000000000000003,19735.25,7,92950,0.25,15600,6.25,92950,0.25,18085,6.25]
[null,92975,0.28000000000000003,19742.25,7,92975,0.25,15606.25,6.25,92975,0.25,18091.25,6.25]
[null,93000,0.28000000000000003,19749.25,7,93000,0.25,15612.5,6.25,93000,0.25,18097.5,6.25]
[null,93025,0.28000000000000003,19756.25,7,93025,0.25,15618.75,6.25,93025,0.25,18103.75,6.25]
[null,93050,0.28000000000000003,19763.25,7,93050,0.25,15625,6.25,93050,0.25,18110,6.25]
[null,93075,0.28000000000000003,19770.25,7,93075,0.25,15631.25,6.25,93075,0.25,18116.25,6.25]
[null,93100,0.28000000000000003,19777.25,7,93100,0.25,15637.5,6.25,93100,0.25,18122.5,6.25]
[null,93125,0.28000000000000003,19784.25,7,93125,0.25,15643.75,6.25,93125,0.25,18128.75,6.25]
[null,93150,0.28000000000000003,19791.25,7,93150,0.25,15650,6.25,93150,0.25,18135,6.25]
[null,93175,0.28000000000000003,19798.25,7,93175,0.25,15656.25,6.25,93175,0.25,18141.25,6.25]
[null,93200,0.28000000000000003,19805.25,7,93200,0.25,15662.5,6.25,93200,0.25,18147.5,6.25]
[null,93225,0.28000000000000003,19812.25,7,93225,0.25,15668.75,6.25,93225,0.25,18153.75,6.25]
[null,93250,0.28000000000000003,19819.25,7,93250,0.25,15675,6.25,93250,0.25,18160,6.25]
[null,93275,0.28000000000000003,19826.25,7,93275,0.25,15681.25,6.25,93275,0.25,18166.25,6.25]
[null,93300,0.28000000000000003,19833.25,7,93300,0.25,15687.5,6.25,93300,0.25,18172.5,6.25]
[null,93325,0.28000000000000003,19840.25,7,93325,0.25,15693.75,6.25,93325,0.25,18178.75,6.25]
[null,93350,0.28000000000000003,19847.25,7,93350,0.25,15700,6.25,93350,0.25,18185,6.25]
[null,93375,0.28000000000000003,19854.25,7,93375,0.25,15706.25,6.25,93375,0.25,18191.25,6.25]
[null,93400,0.28000000000000003,19861.25,7,93400,0.25,15712.5,6.25,93400,0.25,18197.5,6.25]
[null,93425,0.28000000000000003,19868.25,7,93425,0.25,15718.75,6.25,93425,0.25,18203.75,6.25]
[null,93450,0.28000000000000003,19875.25,7,93450,0.25,15725,6.25,93450,0.25,18210,6.25]
[null,93475,0.28000000000000003,19882.25,7,93475,0.25,15731.25,6.25,93475,0.25,18216.25,6.25]
[null,93500,0.28000000000000003,19889.25,7,93500,0.25,15737.5,6.25,93500,0.25,18222.5,6.25]
[null,93525,0.28000000000000003,19896.25,7,93525,0.25,15743.75,6.25,93525,0.25,18228.75,6.25]
[null,93550,0.28000000000000003,19903.25,7,93550,0.25,15750,6.25,93550,0.25,18235,6.25]
[null,93575,0.28000000000000003,19910.25,7,93575,0.25,15756.25,6.25,93575,0.25,{"$f":"+(J3752-45550)*K3752+$L$1831","v":18241.25},6.25]
[null,93600,0.28000000000000003,19917.25,7,93600,0.25,15762.5,6.25,93600,0.25,18247.5,6.25]
[null,93625,0.28000000000000003,{"$f":"(B3754-82400)*C3754+$D$3305","v":19924.25},7,93625,0.25,{"$f":"(F3754-68000)*G3754+$H$2729","v":15768.75},6.25,93625,0.25,18253.75,6.25]
[null,93650,0.28000000000000003,19931.25,7,93650,0.25,15775,6.25,93650,0.25,18260,6.25]
[null,93675,0.28000000000000003,19938.25,7,93675,0.25,15781.25,6.25,93675,0.25,18266.25,6.25]
[null,93700,0.28000000000000003,19945.25,7,93700,0.25,15787.5,6.25,93700,0.25,18272.5,6.25]
[null,93725,0.28000000000000003,19952.25,7,93725,0.25,15793.75,6.25,93725,0.25,18278.75,6.25]
[null,93750,0.28000000000000003,19959.25,7,93750,0.25,15800,6.25,93750,0.25,18285,6.25]
[null,93775,0.28000000000000003,19966.25,7,93775,0.25,15806.25,6.25,93775,0.25,18291.25,6.25]
[null,93800,0.28000000000000003,19973.25,7,93800,0.25,15812.5,6.25,93800,0.25,18297.5,6.25]
[null,93825,0.28000000000000003,19980.25,7,93825,0.25,15818.75,6.25,93825,0.25,18303.75,6.25]
[null,93850,0.28000000000000003,19987.25,7,93850,0.25,15825,6.25,93850,0.25,18310,6.25]
[null,93875,0.28000000000000003,19994.25,7,93875,0.25,15831.25,6.25,93875,0.25,18316.25,6.25]
[null,93900,0.28000000000000003,20001.25,{"$f":"+D3765-D3764","v":7},93900,0.25,15837.5,6.25,93900,0.25,18322.5,6.25]
[null,93925,0.28000000000000003,20008.25,7,93925,0.25,15843.75,6.25,93925,0.25,18328.75,6.25]
[null,93950,0.28000000000000003,20015.25,7,93950,0.25,15850,6.25,93950,0.25,18335,6.25]
[null,93975,0.28000000000000003,20022.25,7,93975,0.25,15856.25,6.25,93975,0.25,18341.25,6.25]
[null,94000,0.28000000000000003,20029.25,7,94000,0.25,15862.5,6.25,94000,0.25,18347.5,6.25]
[null,94025,0.28000000000000003,20036.25,7,94025,0.25,15868.75,6.25,94025,0.25,18353.75,6.25]
[null,94050,0.28000000000000003,20043.25,7,94050,0.25,15875,6.25,94050,0.25,18360,6.25]
[null,94075,0.28000000000000003,20050.25,7,94075,0.25,15881.25,6.25,94075,0.25,18366.25,6.25]
[null,94100,0.28000000000000003,20057.25,7,94100,0.25,15887.5,6.25,94100,0.25,18372.5,6.25]
[null,94125,0.28000000000000003,20064.25,7,94125,0.25,15893.75,6.25,94125,0.25,18378.75,6.25]
[null,94150,0.28000000000000003,20071.25,7,94150,0.25,15900,6.25,94150,0.25,18385,6.25]
[null,94175,0.28000000000000003,20078.25,7,94175,0.25,15906.25,6.25,94175,0.25,18391.25,6.25]
[null,94200,0.28000000000000003,20085.25,7,94200,0.25,15912.5,6.25,94200,0.25,18397.5,6.25]
[null,94225,0.28000000000000003,20092.25,7,94225,0.25,15918.75,6.25,94225,0.25,18403.75,6.25]
[null,94250,0.28000000000000003,20099.25,7,94250,0.25,15925,6.25,94250,0.25,18410,6.25]
[null,94275,0.28000000000000003,20106.25,7,94275,0.25,15931.25,6.25,94275,0.25,18416.25,6.25]
[null,94300,0.28000000000000003,20113.25,7,94300,0.25,15937.5,6.25,94300,0.25,18422.5,6.25]
[null,94325,0.28000000000000003,20120.25,7,94325,0.25,15943.75,6.25,94325,0.25,18428.75,6.25]
[null,94350,0.28000000000000003,20127.25,7,94350,0.25,15950,6.25,94350,0.25,18435,6.25]
[null,94375,0.28000000000000003,20134.25,7,94375,0.25,15956.25,6.25,94375,0.25,18441.25,6.25]
[null,94400,0.28000000000000003,20141.25,7,94400,0.25,15962.5,6.25,94400,0.25,18447.5,6.25]
[null,94425,0.28000000000000003,20148.25,7,94425,0.25,15968.75,{"$f":"+H3786-H3785","v":6.25},94425,0.25,18453.75,{"$f":"+L3786-L3785","v":6.25}]
[null,94450,0.28000000000000003,20155.25,7,94450,0.25,15975,6.25,94450,0.25,18460,6.25]
[null,94475,0.28000000000000003,20162.25,7,94475,0.25,15981.25,6.25,94475,0.25,18466.25,6.25]
[null,94500,0.28000000000000003,20169.25,7,94500,0.25,15987.5,6.25,94500,0.25,18472.5,6.25]
[null,94525,0.28000000000000003,20176.25,7,94525,0.25,15993.75,6.25,94525,0.25,18478.75,6.25]
[null,94550,0.28000000000000003,20183.25,7,94550,0.25,16000,6.25,94550,0.25,18485,6.25]
[null,94575,0.28000000000000003,20190.25,7,94575,0.25,16006.25,6.25,94575,0.25,18491.25,6.25]
[null,94600,0.28000000000000003,20197.25,7,94600,0.25,16012.5,6.25,94600,0.25,18497.5,6.25]
[null,94625,0.28000000000000003,20204.25,7,94625,0.25,16018.75,6.25,94625,0.25,18503.75,6.25]
[null,94650,0.28000000000000003,20211.25,7,94650,0.25,16025,6.25,94650,0.25,18510,6.25]
[null,94675,0.28000000000000003,20218.25,7,94675,0.25,16031.25,6.25,94675,0.25,18516.25,6.25]
[null,94700,0.28000000000000003,20225.25,7,94700,0.25,16037.5,6.25,94700,0.25,18522.5,6.25]
[null,94725,0.28000000000000003,20232.25,7,94725,0.25,16043.75,6.25,94725,0.25,18528.75,6.25]
[null,94750,0.28000000000000003,20239.25,7,94750,0.25,16050,6.25,94750,0.25,18535,6.25]
[null,94775,0.28000000000000003,20246.25,7,94775,0.25,16056.25,6.25,94775,0.25,18541.25,6.25]
[null,94800,0.28000000000000003,20253.25,7,94800,0.25,16062.5,6.25,94800,0.25,18547.5,6.25]
[null,94825,0.28000000000000003,20260.25,7,94825,0.25,16068.75,6.25,94825,0.25,18553.75,6.25]
[null,94850,0.28000000000000003,20267.25,7,94850,0.25,16075,6.25,94850,0.25,18560,6.25]
[null,94875,0.28000000000000003,20274.25,7,94875,0.25,16081.25,6.25,94875,0.25,18566.25,6.25]
[null,94900,0.28000000000000003,20281.25,7,94900,0.25,16087.5,6.25,94900,0.25,18572.5,6.25]
[null,94925,0.28000000000000003,20288.25,7,94925,0.25,16093.75,6.25,94925,0.25,18578.75,6.25]
[null,94950,0.28000000000000003,20295.25,7,94950,0.25,16100,6.25,94950,0.25,18585,6.25]
[null,94975,0.28000000000000003,20302.25,7,94975,0.25,16106.25,6.25,94975,0.25,18591.25,6.25]
[null,95000,0.28000000000000003,20309.25,7,95000,0.25,16112.5,6.25,95000,0.25,18597.5,6.25]
[null,95025,0.28000000000000003,20316.25,7,95025,0.25,16118.75,6.25,95025,0.25,18603.75,6.25]
[null,95050,0.28000000000000003,20323.25,7,95050,0.25,16125,6.25,95050,0.25,18610,6.25]
[null,95075,0.28000000000000003,20330.25,7,95075,0.25,16131.25,6.25,95075,0.25,18616.25,6.25]
[null,95100,0.28000000000000003,20337.25,7,95100,0.25,16137.5,6.25,95100,0.25,18622.5,6.25]
[null,95125,0.28000000000000003,20344.25,7,95125,0.25,16143.75,6.25,95125,0.25,18628.75,6.25]
[null,95150,0.28000000000000003,20351.25,7,95150,0.25,16150,6.25,95150,0.25,18635,6.25]
[null,95175,0.28000000000000003,20358.25,7,95175,0.25,16156.25,6.25,95175,0.25,{"$f":"+(J3816-45550)*K3816+$L$1831","v":18641.25},6.25]
[null,95200,0.28000000000000003,20365.25,7,95200,0.25,16162.5,6.25,95200,0.25,18647.5,6.25]
[null,95225,0.28000000000000003,{"$f":"(B3818-82400)*C3818+$D$3305","v":20372.25},7,95225,0.25,{"$f":"(F3818-68000)*G3818+$H$2729","v":16168.75},6.25,95225,0.25,18653.75,6.25]
[null,95250,0.28000000000000003,20379.25,7,95250,0.25,16175,6.25,95250,0.25,18660,6.25]
[null,95275,0.28000000000000003,20386.25,7,95275,0.25,16181.25,6.25,95275,0.25,18666.25,6.25]
[null,95300,0.28000000000000003,20393.25,7,95300,0.25,16187.5,6.25,95300,0.25,18672.5,6.25]
[null,95325,0.28000000000000003,20400.25,7,95325,0.25,16193.75,6.25,95325,0.25,18678.75,6.25]
[null,95350,0.28000000000000003,20407.25,7,95350,0.25,16200,6.25,95350,0.25,18685,6.25]
[null,95375,0.28000000000000003,20414.25,7,95375,0.25,16206.25,6.25,95375,0.25,18691.25,6.25]
[null,95400,0.28000000000000003,20421.25,7,95400,0.25,16212.5,6.25,95400,0.25,18697.5,6.25]
[null,95425,0.28000000000000003,20428.25,7,95425,0.25,16218.75,6.25,95425,0.25,18703.75,6.25]
[null,95450,0.28000000000000003,20435.25,7,95450,0.25,16225,6.25,95450,0.25,18710,6.25]
[null,95475,0.28000000000000003,20442.25,7,95475,0.25,16231.25,6.25,95475,0.25,18716.25,6.25]
[null,95500,0.28000000000000003,20449.25,{"$f":"+D3829-D3828","v":7},95500,0.25,16237.5,6.25,95500,0.25,18722.5,6.25]
[null,95525,0.28000000000000003,20456.25,7,95525,0.25,16243.75,6.25,95525,0.25,18728.75,6.25]
[null,95550,0.28000000000000003,20463.25,7,95550,0.25,16250,6.25,95550,0.25,18735,6.25]
[null,95575,0.28000000000000003,20470.25,7,95575,0.25,16256.25,6.25,95575,0.25,18741.25,6.25]
[null,95600,0.28000000000000003,20477.25,7,95600,0.25,16262.5,6.25,95600,0.25,18747.5,6.25]
[null,95625,0.28000000000000003,20484.25,7,95625,0.25,16268.75,6.25,95625,0.25,18753.75,6.25]
[null,95650,0.28000000000000003,20491.25,7,95650,0.25,16275,6.25,95650,0.25,18760,6.25]
[null,95675,0.28000000000000003,20498.25,7,95675,0.25,16281.25,6.25,95675,0.25,18766.25,6.25]
[null,95700,0.28000000000000003,20505.25,7,95700,0.25,16287.5,6.25,95700,0.25,18772.5,6.25]
[null,95725,0.28000000000000003,20512.25,7,95725,0.25,16293.75,6.25,95725,0.25,18778.75,6.25]
[null,95750,0.28000000000000003,20519.25,7,95750,0.25,16300,6.25,95750,0.25,18785,6.25]
[null,95775,0.28000000000000003,20526.25,7,95775,0.25,16306.25,6.25,95775,0.25,18791.25,6.25]
[null,95800,0.28000000000000003,20533.25,7,95800,0.25,16312.5,6.25,95800,0.25,18797.5,6.25]
[null,95825,0.28000000000000003,20540.25,7,95825,0.25,16318.75,6.25,95825,0.25,18803.75,6.25]
[null,95850,0.28000000000000003,20547.25,7,95850,0.25,16325,6.25,95850,0.25,18810,6.25]
[null,95875,0.28000000000000003,20554.25,7,95875,0.25,16331.25,6.25,95875,0.25,18816.25,6.25]
[null,95900,0.28000000000000003,20561.25,7,95900,0.25,16337.5,6.25,95900,0.25,18822.5,6.25]
[null,95925,0.28000000000000003,20568.25,7,95925,0.25,16343.75,6.25,95925,0.25,18828.75,6.25]
[null,95950,0.28000000000000003,20575.25,7,95950,0.25,16350,6.25,95950,0.25,18835,6.25]
[null,95975,0.28000000000000003,20582.25,7,95975,0.25,16356.25,6.25,95975,0.25,18841.25,6.25]
[null,96000,0.28000000000000003,20589.25,7,96000,0.25,16362.5,6.25,96000,0.25,18847.5,6.25]
[null,96025,0.28000000000000003,20596.25,7,96025,0.25,16368.75,{"$f":"+H3850-H3849","v":6.25},96025,0.25,18853.75,{"$f":"+L3850-L3849","v":6.25}]
[null,96050,0.28000000000000003,20603.25,7,96050,0.25,16375,6.25,96050,0.25,18860,6.25]
[null,96075,0.28000000000000003,20610.25,7,96075,0.25,16381.25,6.25,96075,0.25,18866.25,6.25]
[null,96100,0.28000000000000003,20617.25,7,96100,0.25,16387.5,6.25,96100,0.25,18872.5,6.25]
[null,96125,0.28000000000000003,20624.25,7,96125,0.25,16393.75,6.25,96125,0.25,18878.75,6.25]
[null,96150,0.28000000000000003,20631.25,7,96150,0.25,16400,6.25,96150,0.25,18885,6.25]
[null,96175,0.28000000000000003,20638.25,7,96175,0.25,16406.25,6.25,96175,0.25,18891.25,6.25]
[null,96200,0.28000000000000003,20645.25,7,96200,0.25,16412.5,6.25,96200,0.25,18897.5,6.25]
[null,96225,0.28000000000000003,20652.25,7,96225,0.25,16418.75,6.25,96225,0.25,18903.75,6.25]
[null,96250,0.28000000000000003,20659.25,7,96250,0.25,16425,6.25,96250,0.25,18910,6.25]
[null,96275,0.28000000000000003,20666.25,7,96275,0.25,16431.25,6.25,96275,0.25,18916.25,6.25]
[null,96300,0.28000000000000003,20673.25,7,96300,0.25,16437.5,6.25,96300,0.25,18922.5,6.25]
[null,96325,0.28000000000000003,20680.25,7,96325,0.25,16443.75,6.25,96325,0.25,18928.75,6.25]
[null,96350,0.28000000000000003,20687.25,7,96350,0.25,16450,6.25,96350,0.25,18935,6.25]
[null,96375,0.28000000000000003,20694.25,7,96375,0.25,16456.25,6.25,96375,0.25,18941.25,6.25]
[null,96400,0.28000000000000003,20701.25,7,96400,0.25,16462.5,6.25,96400,0.25,18947.5,6.25]
[null,96425,0.28000000000000003,20708.25,7,96425,0.25,16468.75,6.25,96425,0.25,18953.75,6.25]
[null,96450,0.28000000000000003,20715.25,7,96450,0.25,16475,6.25,96450,0.25,18960,6.25]
[null,96475,0.28000000000000003,20722.25,7,96475,0.25,16481.25,6.25,96475,0.25,18966.25,6.25]
[null,96500,0.28000000000000003,20729.25,7,96500,0.25,16487.5,6.25,96500,0.25,18972.5,6.25]
[null,96525,0.28000000000000003,20736.25,7,96525,0.25,16493.75,6.25,96525,0.25,18978.75,6.25]
[null,96550,0.28000000000000003,20743.25,7,96550,0.25,16500,6.25,96550,0.25,18985,6.25]
[null,96575,0.28000000000000003,20750.25,7,96575,0.25,16506.25,6.25,96575,0.25,18991.25,6.25]
[null,96600,0.28000000000000003,20757.25,7,96600,0.25,16512.5,6.25,96600,0.25,18997.5,6.25]
[null,96625,0.28000000000000003,20764.25,7,96625,0.25,16518.75,6.25,96625,0.25,19003.75,6.25]
[null,96650,0.28000000000000003,20771.25,7,96650,0.25,16525,6.25,96650,0.25,19010,6.25]
[null,96675,0.28000000000000003,20778.25,7,96675,0.25,16531.25,6.25,96675,0.25,19016.25,6.25]
[null,96700,0.28000000000000003,20785.25,7,96700,0.25,16537.5,6.25,96700,0.25,19022.5,6.25]
[null,96725,0.28000000000000003,20792.25,7,96725,0.25,16543.75,6.25,96725,0.25,19028.75,6.25]
[null,96750,0.28000000000000003,20799.25,7,96750,0.25,16550,6.25,96750,0.25,19035,6.25]
[null,96775,0.28000000000000003,20806.25,7,96775,0.25,16556.25,6.25,96775,0.25,{"$f":"+(J3880-45550)*K3880+$L$1831","v":19041.25},6.25]
[null,96800,0.28000000000000003,20813.25,7,96800,0.25,16562.5,6.25,96800,0.25,19047.5,6.25]
[null,96825,0.28000000000000003,{"$f":"(B3882-82400)*C3882+$D$3305","v":20820.25},7,96825,0.25,{"$f":"(F3882-68000)*G3882+$H$2729","v":16568.75},6.25,96825,0.25,19053.75,6.25]
[null,96850,0.28000000000000003,20827.25,7,96850,0.25,16575,6.25,96850,0.25,19060,6.25]
[null,96875,0.28000000000000003,20834.25,7,96875,0.25,16581.25,6.25,96875,0.25,19066.25,6.25]
[null,96900,0.28000000000000003,20841.25,7,96900,0.25,16587.5,6.25,96900,0.25,19072.5,6.25]
[null,96925,0.28000000000000003,20848.25,7,96925,0.25,16593.75,6.25,96925,0.25,19078.75,6.25]
[null,96950,0.28000000000000003,20855.25,7,96950,0.25,16600,6.25,96950,0.25,19085,6.25]
[null,96975,0.28000000000000003,20862.25,7,96975,0.25,16606.25,6.25,96975,0.25,19091.25,6.25]
[null,97000,0.28000000000000003,20869.25,7,97000,0.25,16612.5,6.25,97000,0.25,19097.5,6.25]
[null,97025,0.28000000000000003,20876.25,7,97025,0.25,16618.75,6.25,97025,0.25,19103.75,6.25]
[null,97050,0.28000000000000003,20883.25,7,97050,0.25,16625,6.25,97050,0.25,19110,6.25]
[null,97075,0.28000000000000003,20890.25,7,97075,0.25,16631.25,6.25,97075,0.25,19116.25,6.25]
[null,97100,0.28000000000000003,20897.25,{"$f":"+D3893-D3892","v":7},97100,0.25,16637.5,6.25,97100,0.25,19122.5,6.25]
[null,97125,0.28000000000000003,20904.25,7,97125,0.25,16643.75,6.25,97125,0.25,19128.75,6.25]
[null,97150,0.28000000000000003,20911.25,7,97150,0.25,16650,6.25,97150,0.25,19135,6.25]
[null,97175,0.28000000000000003,20918.25,7,97175,0.25,16656.25,6.25,97175,0.25,19141.25,6.25]
[null,97200,0.28000000000000003,20925.25,7,97200,0.25,16662.5,6.25,97200,0.25,19147.5,6.25]
[null,97225,0.28000000000000003,20932.25,7,97225,0.25,16668.75,6.25,97225,0.25,19153.75,6.25]
[null,97250,0.28000000000000003,20939.25,7,97250,0.25,16675,6.25,97250,0.25,19160,6.25]
[null,97275,0.28000000000000003,20946.25,7,97275,0.25,16681.25,6.25,97275,0.25,19166.25,6.25]
[null,97300,0.28000000000000003,20953.25,7,97300,0.25,16687.5,6.25,97300,0.25,19172.5,6.25]
[null,97325,0.28000000000000003,20960.25,7,97325,0.25,16693.75,6.25,97325,0.25,19178.75,6.25]
[null,97350,0.28000000000000003,20967.25,7,97350,0.25,16700,6.25,97350,0.25,19185,6.25]
[null,97375,0.28000000000000003,20974.25,7,97375,0.25,16706.25,6.25,97375,0.25,19191.25,6.25]
[null,97400,0.28000000000000003,20981.25,7,97400,0.25,16712.5,6.25,97400,0.25,19197.5,6.25]
[null,97425,0.28000000000000003,20988.25,7,97425,0.25,16718.75,6.25,97425,0.25,19203.75,6.25]
[null,97450,0.28000000000000003,20995.25,7,97450,0.25,16725,6.25,97450,0.25,19210,6.25]
[null,97475,0.28000000000000003,21002.25,7,97475,0.25,16731.25,6.25,97475,0.25,19216.25,6.25]
[null,97500,0.28000000000000003,21009.25,7,97500,0.25,16737.5,6.25,97500,0.25,19222.5,6.25]
[null,97525,0.28000000000000003,21016.25,7,97525,0.25,16743.75,6.25,97525,0.25,19228.75,6.25]
[null,97550,0.28000000000000003,21023.25,7,97550,0.25,16750,6.25,97550,0.25,19235,6.25]
[null,97575,0.28000000000000003,21030.25,7,97575,0.25,16756.25,6.25,97575,0.25,19241.25,6.25]
[null,97600,0.28000000000000003,21037.25,7,97600,0.25,16762.5,6.25,97600,0.25,19247.5,6.25]
[null,97625,0.28000000000000003,21044.25,7,97625,0.25,16768.75,{"$f":"+H3914-H3913","v":6.25},97625,0.25,19253.75,{"$f":"+L3914-L3913","v":6.25}]
[null,97650,0.28000000000000003,21051.25,7,97650,0.25,16775,6.25,97650,0.25,19260,6.25]
[null,97675,0.28000000000000003,21058.25,7,97675,0.25,16781.25,6.25,97675,0.25,19266.25,6.25]
[null,97700,0.28000000000000003,21065.25,7,97700,0.25,16787.5,6.25,97700,0.25,19272.5,6.25]
[null,97725,0.28000000000000003,21072.25,7,97725,0.25,16793.75,6.25,97725,0.25,19278.75,6.25]
[null,97750,0.28000000000000003,21079.25,7,97750,0.25,16800,6.25,97750,0.25,19285,6.25]
[null,97775,0.28000000000000003,21086.25,7,97775,0.25,16806.25,6.25,97775,0.25,19291.25,6.25]
[null,97800,0.28000000000000003,21093.25,7,97800,0.25,16812.5,6.25,97800,0.25,19297.5,6.25]
[null,97825,0.28000000000000003,21100.25,7,97825,0.25,16818.75,6.25,97825,0.25,19303.75,6.25]
[null,97850,0.28000000000000003,21107.25,7,97850,0.25,16825,6.25,97850,0.25,19310,6.25]
[null,97875,0.28000000000000003,21114.25,7,97875,0.25,16831.25,6.25,97875,0.25,19316.25,6.25]
[null,97900,0.28000000000000003,21121.25,7,97900,0.25,16837.5,6.25,97900,0.25,19322.5,6.25]
[null,97925,0.28000000000000003,21128.25,7,97925,0.25,16843.75,6.25,97925,0.25,19328.75,6.25]
[null,97950,0.28000000000000003,21135.25,7,97950,0.25,16850,6.25,97950,0.25,19335,6.25]
[null,97975,0.28000000000000003,21142.25,7,97975,0.25,16856.25,6.25,97975,0.25,19341.25,6.25]
[null,98000,0.28000000000000003,21149.25,7,98000,0.25,16862.5,6.25,98000,0.25,19347.5,6.25]
[null,98025,0.28000000000000003,21156.25,7,98025,0.25,16868.75,6.25,98025,0.25,19353.75,6.25]
[null,98050,0.28000000000000003,21163.25,7,98050,0.25,16875,6.25,98050,0.25,19360,6.25]
[null,98075,0.28000000000000003,21170.25,7,98075,0.25,16881.25,6.25,98075,0.25,19366.25,6.25]
[null,98100,0.28000000000000003,21177.25,7,98100,0.25,16887.5,6.25,98100,0.25,19372.5,6.25]
[null,98125,0.28000000000000003,21184.25,7,98125,0.25,16893.75,6.25,98125,0.25,19378.75,6.25]
[null,98150,0.28000000000000003,21191.25,7,98150,0.25,16900,6.25,98150,0.25,19385,6.25]
[null,98175,0.28000000000000003,21198.25,7,98175,0.25,16906.25,6.25,98175,0.25,19391.25,6.25]
[null,98200,0.28000000000000003,21205.25,7,98200,0.25,16912.5,6.25,98200,0.25,19397.5,6.25]
[null,98225,0.28000000000000003,21212.25,7,98225,0.25,16918.75,6.25,98225,0.25,19403.75,6.25]
[null,98250,0.28000000000000003,21219.25,7,98250,0.25,16925,6.25,98250,0.25,19410,6.25]
[null,98275,0.28000000000000003,21226.25,7,98275,0.25,16931.25,6.25,98275,0.25,19416.25,6.25]
[null,98300,0.28000000000000003,21233.25,7,98300,0.25,16937.5,6.25,98300,0.25,19422.5,6.25]
[null,98325,0.28000000000000003,21240.25,7,98325,0.25,16943.75,6.25,98325,0.25,19428.75,6.25]
[null,98350,0.28000000000000003,21247.25,7,98350,0.25,16950,6.25,98350,0.25,19435,6.25]
[null,98375,0.28000000000000003,21254.25,7,98375,0.25,16956.25,6.25,98375,0.25,{"$f":"+(J3944-45550)*K3944+$L$1831","v":19441.25},6.25]
[null,98400,0.28000000000000003,21261.25,7,98400,0.25,16962.5,6.25,98400,0.25,19447.5,6.25]
[null,98425,0.28000000000000003,{"$f":"(B3946-82400)*C3946+$D$3305","v":21268.25},7,98425,0.25,{"$f":"(F3946-68000)*G3946+$H$2729","v":16968.75},6.25,98425,0.25,19453.75,6.25]
[null,98450,0.28000000000000003,21275.25,7,98450,0.25,16975,6.25,98450,0.25,19460,6.25]
[null,98475,0.28000000000000003,21282.25,7,98475,0.25,16981.25,6.25,98475,0.25,19466.25,6.25]
[null,98500,0.28000000000000003,21289.25,7,98500,0.25,16987.5,6.25,98500,0.25,19472.5,6.25]
[null,98525,0.28000000000000003,21296.25,7,98525,0.25,16993.75,6.25,98525,0.25,19478.75,6.25]
[null,98550,0.28000000000000003,21303.25,7,98550,0.25,17000,6.25,98550,0.25,19485,6.25]
[null,98575,0.28000000000000003,21310.25,7,98575,0.25,17006.25,6.25,98575,0.25,19491.25,6.25]
[null,98600,0.28000000000000003,21317.25,7,98600,0.25,17012.5,6.25,98600,0.25,19497.5,6.25]
[null,98625,0.28000000000000003,21324.25,7,98625,0.25,17018.75,6.25,98625,0.25,19503.75,6.25]
[null,98650,0.28000000000000003,21331.25,7,98650,0.25,17025,6.25,98650,0.25,19510,6.25]
[null,98675,0.28000000000000003,21338.25,7,98675,0.25,17031.25,6.25,98675,0.25,19516.25,6.25]
[null,98700,0.28000000000000003,21345.25,{"$f":"+D3957-D3956","v":7},98700,0.25,17037.5,6.25,98700,0.25,19522.5,6.25]
[null,98725,0.28000000000000003,21352.25,7,98725,0.25,17043.75,6.25,98725,0.25,19528.75,6.25]
[null,98750,0.28000000000000003,21359.25,7,98750,0.25,17050,6.25,98750,0.25,19535,6.25]
[null,98775,0.28000000000000003,21366.25,7,98775,0.25,17056.25,6.25,98775,0.25,19541.25,6.25]
[null,98800,0.28000000000000003,21373.25,7,98800,0.25,17062.5,6.25,98800,0.25,19547.5,6.25]
[null,98825,0.28000000000000003,21380.25,7,98825,0.25,17068.75,6.25,98825,0.25,19553.75,6.25]
[null,98850,0.28000000000000003,21387.25,7,98850,0.25,17075,6.25,98850,0.25,19560,6.25]
[null,98875,0.28000000000000003,21394.25,7,98875,0.25,17081.25,6.25,98875,0.25,19566.25,6.25]
[null,98900,0.28000000000000003,21401.25,7,98900,0.25,17087.5,6.25,98900,0.25,19572.5,6.25]
[null,98925,0.28000000000000003,21408.25,7,98925,0.25,17093.75,6.25,98925,0.25,19578.75,6.25]
[null,98950,0.28000000000000003,21415.25,7,98950,0.25,17100,6.25,98950,0.25,19585,6.25]
[null,98975,0.28000000000000003,21422.25,7,98975,0.25,17106.25,6.25,98975,0.25,19591.25,6.25]
[null,99000,0.28000000000000003,21429.25,7,99000,0.25,17112.5,6.25,99000,0.25,19597.5,6.25]
[null,99025,0.28000000000000003,21436.25,7,99025,0.25,17118.75,6.25,99025,0.25,19603.75,6.25]
[null,99050,0.28000000000000003,21443.25,7,99050,0.25,17125,6.25,99050,0.25,19610,6.25]
[null,99075,0.28000000000000003,21450.25,7,99075,0.25,17131.25,6.25,99075,0.25,19616.25,6.25]
[null,99100,0.28000000000000003,21457.25,7,99100,0.25,17137.5,6.25,99100,0.25,19622.5,6.25]
[null,99125,0.28000000000000003,21464.25,7,99125,0.25,17143.75,6.25,99125,0.25,19628.75,6.25]
[null,99150,0.28000000000000003,21471.25,7,99150,0.25,17150,6.25,99150,0.25,19635,6.25]
[null,99175,0.28000000000000003,21478.25,7,99175,0.25,17156.25,6.25,99175,0.25,19641.25,6.25]
[null,99200,0.28000000000000003,21485.25,7,99200,0.25,17162.5,6.25,99200,0.25,19647.5,6.25]
[null,99225,0.28000000000000003,21492.25,7,99225,0.25,17168.75,{"$f":"+H3978-H3977","v":6.25},99225,0.25,19653.75,{"$f":"+L3978-L3977","v":6.25}]
[null,99250,0.28000000000000003,21499.25,7,99250,0.25,17175,6.25,99250,0.25,19660,6.25]
[null,99275,0.28000000000000003,21506.25,7,99275,0.25,17181.25,6.25,99275,0.25,19666.25,6.25]
[null,99300,0.28000000000000003,21513.25,7,99300,0.25,17187.5,6.25,99300,0.25,19672.5,6.25]
[null,99325,0.28000000000000003,21520.25,7,99325,0.25,17193.75,6.25,99325,0.25,19678.75,6.25]
[null,99350,0.28000000000000003,21527.25,7,99350,0.25,17200,6.25,99350,0.25,19685,6.25]
[null,99375,0.28000000000000003,21534.25,7,99375,0.25,17206.25,6.25,99375,0.25,19691.25,6.25]
[null,99400,0.28000000000000003,21541.25,7,99400,0.25,17212.5,6.25,99400,0.25,19697.5,6.25]
[null,99425,0.28000000000000003,21548.25,7,99425,0.25,17218.75,6.25,99425,0.25,19703.75,6.25]
[null,99450,0.28000000000000003,21555.25,7,99450,0.25,17225,6.25,99450,0.25,19710,6.25]
[null,99475,0.28000000000000003,21562.25,7,99475,0.25,17231.25,6.25,99475,0.25,19716.25,6.25]
[null,99500,0.28000000000000003,21569.25,7,99500,0.25,17237.5,6.25,99500,0.25,19722.5,6.25]
[null,99525,0.28000000000000003,21576.25,7,99525,0.25,17243.75,6.25,99525,0.25,19728.75,6.25]
[null,99550,0.28000000000000003,21583.25,7,99550,0.25,17250,6.25,99550,0.25,19735,6.25]
[null,99575,0.28000000000000003,21590.25,7,99575,0.25,17256.25,6.25,99575,0.25,19741.25,6.25]
[null,99600,0.28000000000000003,21597.25,7,99600,0.25,17262.5,6.25,99600,0.25,19747.5,6.25]
[null,99625,0.28000000000000003,21604.25,7,99625,0.25,17268.75,6.25,99625,0.25,19753.75,6.25]
[null,99650,0.28000000000000003,21611.25,7,99650,0.25,17275,6.25,99650,0.25,19760,6.25]
[null,99675,0.28000000000000003,21618.25,7,99675,0.25,17281.25,6.25,99675,0.25,19766.25,6.25]
[null,99700,0.28000000000000003,21625.25,7,99700,0.25,17287.5,6.25,99700,0.25,19772.5,6.25]
[null,99725,0.28000000000000003,21632.25,7,99725,0.25,17293.75,6.25,99725,0.25,19778.75,6.25]
[null,99750,0.28000000000000003,21639.25,7,99750,0.25,17300,6.25,99750,0.25,19785,6.25]
[null,99775,0.28000000000000003,21646.25,7,99775,0.25,17306.25,6.25,99775,0.25,19791.25,6.25]
[null,99800,0.28000000000000003,21653.25,7,99800,0.25,17312.5,6.25,99800,0.25,19797.5,6.25]
[null,99825,0.28000000000000003,21660.25,7,99825,0.25,17318.75,6.25,99825,0.25,19803.75,6.25]
[null,99850,0.28000000000000003,21667.25,7,99850,0.25,17325,6.25,99850,0.25,19810,6.25]
[null,99875,0.28000000000000003,21674.25,7,99875,0.25,17331.25,6.25,99875,0.25,19816.25,6.25]
[null,99900,0.28000000000000003,21681.25,7,99900,0.25,17337.5,6.25,99900,0.25,19822.5,6.25]
[null,99925,0.28000000000000003,21688.25,7,99925,0.25,17343.75,6.25,99925,0.25,19828.75,6.25]
[null,99950,0.28000000000000003,21695.25,7,99950,0.25,17350,6.25,99950,0.25,19835,6.25]
[null,99975,0.28000000000000003,21702.25,7,99975,0.25,17356.25,6.25,99975,0.25,{"$f":"+(J4008-45550)*K4008+$L$1831","v":19841.25},6.25]
[null,100000,0.28000000000000003,21709.25,7,100000,0.25,17362.5,6.25,100000,0.25,{"$f":"+(J4009-45550)*K4009+$L$1831","v":19847.5},6.25]

{"sheet":"MCC Disclosure","index":6,"n_rows":147,"n_cols":5,"rows_kept":147,"cut":false,"hidden":false,"merged":[[3,0,3,4],[10,0,10,4],[12,1,12,4],[13,1,13,4],[14,1,14,4],[18,0,18,4],[15,1,15,4],[4,0,4,4],[20,0,20,4],[22,1,22,4],[7,2,7,3],[8,2,9,4],[29,0,29,4],[31,0,31,4],[33,0,33,4],[35,0,35,1],[93,0,93,4],[47,0,47,4],[49,0,49,1],[66,0,66,4],[68,1,68,4],[70,1,70,4],[69,1,69,4],[65,0,65,4],[63,0,63,4],[72,0,72,4],[74,1,74,4],[95,0,95,1],[102,0,102,4],[104,0,104,1],[116,0,116,4],[75,0,75,4],[85,0,85,1],[83,0,83,4],[88,0,88,4],[91,0,91,4],[141,3,141,4],[145,3,145,4],[133,0,133,4],[136,0,136,4],[118,0,118,4],[120,0,120,1]]}
[]
[]
[]
["Is the Mortgage Credit Certificate right for Me?"]
[]
[]
["Applicant(s) Name:",null,"Disclosure Date:"]
[null,{"$f":"'MCC Data Input'!$E$27","v":0},{"$f":"'MCC Data Input'!E7","v":"00:00:00"}]
[null,{"$f":"IF('MCC Data Input'!E28>0,'MCC Data Input'!E28,\" \")","v":" "},{"$f":"IF('MCC Comparison Summary'!E16=\"OVER INCOME\",+'MCC Comparison Summary'!E16,\" \")","v":" "}]
["INTRODUCTION"]
["The City of Portland Mortgage Credit Certificate (MCC) program allows eligible buyers to claim 20 percent of their first mortgage interest as a dollar-for-dollar tax credit versus a traditional tax deduction.  An MCC can increase the amount of a mortgage for which a borrower will qualify. If you expect to pay federal income tax (either through payroll deductions or directly at the end of the year) the MCC may provide a greater savings than other mortgage programs. To participate in the MCC program you must:"]
[]
["· ","Have an annual income at or below $73,000 for a family of one or two, or $83,950 for a family of three or more; and"]
["· ","Purchase a home in the City of Portland with financing from Portland Housing Bureau (PHB) participating lender; and"]
["· ","Be a first-time homebuyer, which Internal Revenue Service defines as not having owned a home in the past three years."]
["· ","If awarded an MCC, you must file IRS form 8296 with your federal income tax return each year during term of the loan."]
[]
["PRODUCT COMPARISON  "]
["You have many options when selecting financing to purchase your first home. This section compares three different financing options including the Oregon Bond, a traditional market rate mortgage and that same market rate loan combined with an MCC."]
[]
["It is important to evaluate the terms of different loan products to determine which is best suited to your individual financial situations and which help you achieve your personal, family and financial goals.  Some people have limited savings but can afford a larger monthly payment.  Others have limited income but have cash in the bank for a down payment.  Some people intend to buy a home and hold it long term, while others plan to own for a shorter period of time. Here are a few key questions you should ask yourself to help compare and select the product that is right for you."]
[]
["· ","How much did you pay in federal income tax last year and do you expect to pay federal income taxes in the years to come?"]
["· ","Do you expect your number of dependents to change over the next 10 years?"]
["· ","How long do you expect to remain in the home?"]
["· ","How much do you expect your income to increase or decrease over the next 10 years?"]
["· ","How much can you comfortably afford to pay for a mortgage each month?"]
[]
["HOW THE MCC PROGRAM WORKS"]
["Under current tax law, a tax payer is generally allowed to claim the interest they pay on their purchase mortgage as a tax deduction. A tax deduction allows you to subtract that item from your gross annual income.  As a result, the amount of your income that is subject to federal income tax goes down."]
[]
["Current tax law also allows for a variety of tax credits.  Unlike a tax deduction which reduces your taxable income, a tax credit provides a dollar-for-dollar reduction in the total amount of federal income tax you pay to the IRS.  The MCC program is an example of a tax credit program.  The tax credit provided by a MCC is not a refundable credit which means it can only be used to reduce the federal income tax you owe for the year to zero.  If, for any given year, the tax credit available to you from holding an MCC is greater than your federal tax liability before taking into account the MCC credit, you can carry forward the unused amount of the MCC credit for three successive tax years.  "]
[]
["The following chart compares a loan with the MCC to the Oregon Bond loan and a traditional market rate mortgage and the difference between the interest deduction and the MCC tax credit."]
[]
[{"$f":"'MCC Comparison Summary'!A17:B17","v":"SALE AND FIRST MORTGAGE LOAN ASSUMPTIONS"},null,{"$f":"'MCC Comparison Summary'!C17","v":"Oregon Bond"},{"$f":"'MCC Comparison Summary'!D17","v":"Traditional Loan"},{"$f":"'MCC Comparison Summary'!E17","v":"MCC"}]
[null,{"$f":"'MCC Comparison Summary'!B18","v":"Sales Price"},{"$f":"'MCC Comparison Summary'!C18","v":0},{"$f":"'MCC Comparison Summary'!D18","v":0},{"$f":"'MCC Comparison Summary'!E18","v":0}]
[null,{"$f":"'MCC Comparison Summary'!B19","v":"Amount of Second Mortgage used for Purchase"},{"$f":"'MCC Comparison Summary'!C19","v":0},{"$f":"'MCC Comparison Summary'!D19","v":0},{"$f":"'MCC Comparison Summary'!E19","v":0}]
[null,{"$f":"'MCC Comparison Summary'!B20","v":"Borrower Down Payment"},{"$f":"'MCC Comparison Summary'!C20","v":0},{"$f":"'MCC Comparison Summary'!D20","v":0},{"$f":"'MCC Comparison Summary'!E20","v":0}]
[null,{"$f":"'MCC Comparison Summary'!B21","v":"FHA Upfront MIP"},{"$f":"'MCC Comparison Summary'!C21","v":0},{"$f":"'MCC Comparison Summary'!D21","v":0},{"$f":"'MCC Comparison Summary'!E21","v":0}]
[null,{"$f":"'MCC Comparison Summary'!B22","v":"First Mortgage Loan Amount (incl. up front MI on FHA loans)"},{"$f":"'MCC Comparison Summary'!C22","v":0},{"$f":"'MCC Comparison Summary'!D22","v":0},{"$f":"'MCC Comparison Summary'!E22","v":0}]
[null,{"$f":"'MCC Comparison Summary'!B23","v":"First Mortgage Note Rate"},{"$f":"'MCC Comparison Summary'!C23","v":0},{"$f":"'MCC Comparison Summary'!D23","v":0},{"$f":"'MCC Comparison Summary'!E23","v":0}]
[null,{"$f":"'MCC Comparison Summary'!B24","v":"Monthly Mortgage Insurance Premium Rate"},{"$f":"'MCC Comparison Summary'!C24","v":0},{"$f":"'MCC Comparison Summary'!D24","v":0},{"$f":"'MCC Comparison Summary'!E24","v":0}]
[null,{"$f":"'MCC Comparison Summary'!B25","v":"Loan Term (years)"},{"$f":"'MCC Comparison Summary'!C25","v":0},{"$f":"'MCC Comparison Summary'!D25","v":0},{"$f":"'MCC Comparison Summary'!E25","v":0}]
[null,{"$f":"'MCC Comparison Summary'!B26","v":"Annual Interest (1st year)"},{"$f":"'MCC Comparison Summary'!C26","v":0},{"$f":"'MCC Comparison Summary'!D26","v":0},{"$f":"'MCC Comparison Summary'!E26","v":0}]
[null,{"$f":"'MCC Comparison Summary'!B27","v":"MCC Credit (20% of 1st year interest)"},{"$f":"'MCC Comparison Summary'!C27","v":4.9999999999999998E-7},{"$f":"'MCC Comparison Summary'!D27","v":5.0000000000000004E-6},{"$f":"'MCC Comparison Summary'!E27","v":0}]
[]
["Here’s how the MCC program might affect your federal tax liability based upon the information your loan officer input into the MCC Comparison Spreadsheet. This will show you which loan program may result in the lowest tax liability to you."]
[]
[{"$f":"'MCC Comparison Summary'!A60:B60","v":"FEDERAL TAX ESTIMATE 1., 2."},null,{"$f":"'MCC Comparison Summary'!C60","v":"Oregon Bond"},{"$f":"'MCC Comparison Summary'!D60","v":"Traditional Loan"},{"$f":"'MCC Comparison Summary'!E60","v":"MCC"}]
[null,{"$f":"'MCC Comparison Summary'!B61:C61","v":"Gross Annual Income"},{"$f":"'MCC Comparison Summary'!C61","v":0},{"$f":"'MCC Comparison Summary'!D61","v":0},{"$f":"'MCC Comparison Summary'!E61","v":0}]
[null,{"$f":"'MCC Comparison Summary'!B62:C62","v":"Less Interest, Property Tax and Mortgage Insurance Deductions"},{"$f":"'MCC Comparison Summary'!C62","v":0},{"$f":"'MCC Comparison Summary'!D62","v":0},{"$f":"'MCC Comparison Summary'!E62","v":0}]
[null,{"$f":"'MCC Comparison Summary'!B63:C63","v":"Less IRS Exemptions"},{"$f":"'MCC Comparison Summary'!C63","v":-3650},{"$f":"'MCC Comparison Summary'!D63","v":-3650},{"$f":"'MCC Comparison Summary'!E63","v":-3650}]
[null,{"$f":"'MCC Comparison Summary'!B64:C64","v":"Other Deductions"},{"$f":"'MCC Comparison Summary'!C64","v":0},{"$f":"'MCC Comparison Summary'!D64","v":0},{"$f":"'MCC Comparison Summary'!E64","v":0}]
[null,{"$f":"'MCC Comparison Summary'!B65:C65","v":"Estimated Taxable Income"},{"$f":"'MCC Comparison Summary'!C65","v":-3650},{"$f":"'MCC Comparison Summary'!D65","v":-3650},{"$f":"'MCC Comparison Summary'!E65","v":-3650}]
[null,{"$f":"'MCC Comparison Summary'!B66","v":"2010 Tax Liability from Calculator"},{"$f":"'MCC Comparison Summary'!C66","v":false},{"$f":"'MCC Comparison Summary'!D66","v":false},{"$f":"'MCC Comparison Summary'!E66","v":false}]
[null,{"$f":"'MCC Comparison Summary'!B67","v":"Estimate Child Tax Credit"},{"$f":"'MCC Comparison Summary'!C67","v":0},{"$f":"'MCC Comparison Summary'!D67","v":0},{"$f":"'MCC Comparison Summary'!E67","v":0}]
[null,{"$f":"'MCC Comparison Summary'!B68","v":"Other Tax Credits (enter as a negative figure)"},{"$f":"'MCC Comparison Summary'!C68","v":0},{"$f":"'MCC Comparison Summary'!D68","v":0},{"$f":"'MCC Comparison Summary'!E68","v":0}]
[null,{"$f":"'MCC Comparison Summary'!B69","v":"Estimated Tax Liability (Before MCC)"},{"$f":"'MCC Comparison Summary'!C69","v":0},{"$f":"'MCC Comparison Summary'!D69","v":0},{"$f":"'MCC Comparison Summary'!E69","v":0}]
[null,{"$f":"'MCC Comparison Summary'!B70","v":"Less VALUE OF MCC Tax Credit (based on anticipated tax liability)"},{"$f":"'MCC Comparison Summary'!C70","v":0},{"$f":"'MCC Comparison Summary'!D70","v":0},{"$f":"'MCC Comparison Summary'!E70","v":0}]
[null,{"$f":"'MCC Comparison Summary'!B71","v":"ESTIMATED Net Fed income Tax Owed 2.3."},{"$f":"'MCC Comparison Summary'!C71","v":0},{"$f":"'MCC Comparison Summary'!D71","v":0},{"$f":"'MCC Comparison Summary'!E71","v":0}]
[]
["The estimated net value of the MCC to you during the first full year of ownership would be:",null,null,null,{"$f":"-E60","v":0}]
["This number may be lower than the full MCC credit available because your \"Estimated Tax Liability (Before MCC)\" above was less than the available \"MCC Credit (20% of 1st year interest)\".  Remember however, that the unused portion of the MCC credit can be carried forward and applied toward your federal income tax liability over the next three years."]
[]
["Recapture Tax"]
["Both the Oregon Bond and the MCC programs require the home to be owner-occupied and each has a recapture clause that allows the IRS, under certain circumstances, to recapture lost tax revenue upon sale of the home.  However, all three of the following must apply for you to be subject to a recapture tax:"]
[]
["· ","You sell the home within nine years from the original purchase date; AND"]
["· ","You sell the home at a profit after accounting for all costs to sell the home; AND"]
["· ","Your income exceeds federal income thresholds.  That threshold is set at the maximum program income limit established in the year you purchase the home plus a 5% annual income increase allowance, adjusted for family size."]
[]
["If ALL three apply, the maximum recapture tax you may have to pay is 6.25% of the original MCC loan amount.  The percentage of recapture tax potential adjusts annually over the first nine years of the loan, starting at 20% of this amount if you sell in the first year, increasing annually at 20% to peak at 100% in year 5, and then decreasing annually by 20% until it is completely removed in year 10.  The chart below reflects this increase and decrease over time.  After year 9 you are no longer subject to a recapture tax."]
[]
[]
["You provided your loan officer with the following information about your plans over the next few years:"]
[]
["· ",{"$f":"'MCC Data Input'!B75","v":"Number of years you expect to own this home"},null,{"$f":"'MCC Data Input'!G75","v":0}]
["· ",{"$f":"'MCC Data Input'!B76","v":"Homebuyer(s) estimated annual income at sale"},"$",{"$f":"'MCC Data Input'!G76","v":0}]
["· ",{"$f":"'MCC Data Input'!B77","v":"Estimated household size at sale"},null,{"$f":"'MCC Data Input'!G77","v":0}]
["· ",{"$f":"'MCC Data Input'!B78","v":"Estimated annual appreciation "},null,{"$f":"'MCC Data Input'!G78","v":0}]
["· ",{"$f":"'MCC Data Input'!B79","v":"Estimated costs of sale"},null,{"$f":"'MCC Data Input'!G79","v":0}]
[]
["Based upon this information, we have estimated the recapture tax impact as outlined below.  If these assumptions change, the recapture tax estimate will change as well."]
[]
[{"$f":"'MCC Comparison Summary'!A72:B72","v":"ESTIMATED RECAPTURE TAX 4."},null,{"$f":"'MCC Comparison Summary'!C72","v":"Oregon Bond"},{"$f":"'MCC Comparison Summary'!D72","v":"Traditional Loan"},{"$f":"'MCC Comparison Summary'!E72","v":"MCC"}]
[null,{"$f":"'MCC Comparison Summary'!B73","v":"Estimated Recapture Tax (only applies if sold within 9 years of purchase)"},{"$f":"'MCC Comparison Summary'!C73","v":{"$error":"#N/A"}},{"$f":"'MCC Comparison Summary'!D73","v":0},{"$f":"'MCC Comparison Summary'!E73","v":{"$error":"#N/A"}}]
[]
["If you intend to sell the home within 9 years of purchase, we recommend that you seek the services of a qualified tax advisor to assist you in determining the full impact of the recapture tax to you.  You can also contact the IRS and request Form 8828 and the form instructions.  Both are available on the IRS website at www.irs.gov. "]
[]
["Note Rate and Annual Percentage Rate (APR) Comparison"]
["There are two interest rates you should evaluate when comparing loan products – the Note Rate and the Annual Percentage Rate (APR.)  The Note Rate is the interest rate used to calculate the monthly payment you will make over the term of the loan.  The APR is intended to make it easier for you to compare loan options by factoring in prepaid financing costs such as loan fees, discount points and mortgage insurance. These costs are added to the total interest you will pay over the term of the loan to determine your “total finance charge.”  This total finance charge is then converted to an interest rate or APR which tells you the true cost of your borrowing over time. "]
[]
["The MCC effectively reduces the interest you pay on your MCC mortgage by returning a portion of that interest to you in the form of a tax credit.  How you use your MCC and what tax liability you have in the future will determine the true impact the MCC will have on your APR over time.  For the program to have any benefit at all, you must file IRS Form 8396 – Mortgage Interest Credit each year with your federal income tax returns. Below are some examples of how the APR for these example mortgages would be affected at different stages of the loan. "]
[]
[{"$f":"'MCC Comparison Summary'!A44:B44","v":"FIRST MORTGAGE APR COMPARISON"},null,{"$f":"C86","v":"Oregon Bond"},{"$f":"D86","v":"Traditional Loan"},{"$f":"E86","v":"MCC"}]
[null,{"$f":"'MCC Comparison Summary'!B45","v":"Estimated Annual Percentage Rate (APR) at closing"},{"$f":"'MCC Comparison Summary'!C45","v":{"$error":"#NUM!"}},{"$f":"'MCC Comparison Summary'!D45","v":{"$error":"#NUM!"}},{"$f":"'MCC Comparison Summary'!E45","v":{"$error":"#NUM!"}}]
[null,{"$f":"'MCC Comparison Summary'!B46","v":"Eff. Interest Rate if MCC is used for only 9 years (but runs 30 yrs)"},null,null,{"$f":"'MCC Comparison Summary'!E46","v":{"$error":"#NUM!"}}]
[null,{"$f":"'MCC Comparison Summary'!B47","v":"Eff. Interest Rate if MCC is used full 30 year term"},null,null,{"$f":"'MCC Comparison Summary'!E47","v":{"$error":"#NUM!"}}]
[null,{"$f":"'MCC Comparison Summary'!B48","v":"Eff. Int. Rate if IRS form 8396 is not filed with federal tax returns"},null,null,{"$f":"'MCC Comparison Summary'!E48","v":{"$error":"#NUM!"}}]
[]
["Payment Comparison"]
["The total amount of your monthly payment is one of the factors that determine how much of a loan your lender will approve.  Because the MCC program provides a dollar-for-dollar reduction in your federal income taxes, many lenders will deduct this amount from your monthly payment for loan qualifying purposes only.  You must make the Total Monthly Mortgage Payment each month and then claim the tax credit at the end of the year when you file your taxes. "]
[]
[{"$f":"'MCC Comparison Summary'!A34:B34","v":"MONTHLY PAYMENT COMPARISON"},null,{"$f":"C96","v":"Oregon Bond"},{"$f":"D96","v":"Traditional Loan"},{"$f":"E96","v":"MCC"}]
[null,{"$f":"'MCC Comparison Summary'!B35","v":"First Mortgage Principal and Interest"},{"$f":"'MCC Comparison Summary'!C35","v":{"$error":"#DIV/0!"}},{"$f":"'MCC Comparison Summary'!D35","v":{"$error":"#DIV/0!"}},{"$f":"'MCC Comparison Summary'!E35","v":{"$error":"#DIV/0!"}}]
[null,{"$f":"'MCC Comparison Summary'!B36","v":"Second Mortgage Principal and Interest"},{"$f":"'MCC Comparison Summary'!C36","v":0},{"$f":"'MCC Comparison Summary'!D36","v":0},{"$f":"'MCC Comparison Summary'!E36","v":0}]
[null,{"$f":"'MCC Comparison Summary'!B37","v":"Estimated Monthly Property Taxes"},{"$f":"'MCC Comparison Summary'!C37","v":0},{"$f":"'MCC Comparison Summary'!D37","v":0},{"$f":"'MCC Comparison Summary'!E37","v":0}]
[null,{"$f":"'MCC Comparison Summary'!B38","v":"Estimated Monthly Hazard Insurance Premium"},{"$f":"'MCC Comparison Summary'!C38","v":0},{"$f":"'MCC Comparison Summary'!D38","v":0},{"$f":"'MCC Comparison Summary'!E38","v":0}]
[null,{"$f":"'MCC Comparison Summary'!B39","v":"Estimated Monthly Mortgage Insurance"},{"$f":"'MCC Comparison Summary'!C39","v":0},{"$f":"'MCC Comparison Summary'!D39","v":0},{"$f":"'MCC Comparison Summary'!E39","v":0}]
[null,{"$f":"'MCC Comparison Summary'!B40","v":"Homeowners Association Dues"},{"$f":"'MCC Comparison Summary'!C40","v":0},{"$f":"'MCC Comparison Summary'!D40","v":0},{"$f":"'MCC Comparison Summary'!E40","v":0}]
[null,{"$f":"'MCC Comparison Summary'!B41","v":"Total Monthly Mortgage Payment"},{"$f":"'MCC Comparison Summary'!C41","v":{"$error":"#DIV/0!"}},{"$f":"'MCC Comparison Summary'!D41","v":{"$error":"#DIV/0!"}},{"$f":"'MCC Comparison Summary'!E41","v":{"$error":"#DIV/0!"}}]
[null,{"$f":"'MCC Comparison Summary'!B42","v":"Maximum Monthly MCC Tax Credit"},{"$f":"'MCC Comparison Summary'!C42","v":0},{"$f":"'MCC Comparison Summary'!D42","v":0},{"$f":"'MCC Comparison Summary'!E42","v":0}]
[null,{"$f":"'MCC Comparison Summary'!B43","v":"Net Effective Monthly Payment"},{"$f":"'MCC Comparison Summary'!C43","v":{"$error":"#DIV/0!"}},{"$f":"'MCC Comparison Summary'!D43","v":{"$error":"#DIV/0!"}},{"$f":"'MCC Comparison Summary'!E43","v":{"$error":"#DIV/0!"}}]
[]
["Loan Fees and Settlement Charges"]
["Loan fees and settlement charges vary by loan product and between lenders.  In researching different financing options you should request a loan cost analysis for each product you are considering.  These estimates detail each fee you are likely to be charged at loan closing.    With recent changes in Federal Truth in Lending Laws to loan disclosure requirements, this document may be called by a different name by different lenders.  Once you have a signed purchase and sale agreement your lender must provide you with a “Truth-in-Lending Disclosure” and a “Good Faith Estimate of Settlement Charges” for each loan product you are considering.    "]
[]
["Two areas to pay particular attention to are “Prepaid Interest” and “Reserves Deposited with Lender”.  You will pay interest on your loan from the date you close to the first of the next month.  This is called “Prepaid Interest”.  You will also be required to make an initial deposit into a reserve account through which your lender will pay your property taxes and hazard insurance.  Lenders will estimate the number of days of interest and the number of months of reserve deposits that will be necessary and these can vary greatly from lender to lender during the initial application phase.  Make sure that each disclosure includes the same number of days of “Prepaid Interest” and the same estimated months of “Reserves.”  If these are different it may incorrectly lead you to believe one product will cost you less at closing than another."]
[]
[{"$f":"'MCC Comparison Summary'!A49:B49","v":"LOAN FEES"},null,{"$f":"C105","v":"Oregon Bond"},{"$f":"D105","v":"Traditional Loan"},{"$f":"E105","v":"MCC"}]
[null,{"$f":"'MCC Comparison Summary'!B50","v":"Loan Origination Fee (% of loan amount)"},{"$f":"'MCC Comparison Summary'!C50","v":0},{"$f":"'MCC Comparison Summary'!D50","v":0},{"$f":"'MCC Comparison Summary'!E50","v":0}]
[null,{"$f":"'MCC Comparison Summary'!B51","v":"Loan Origination Fee ($ amount)"},{"$f":"'MCC Comparison Summary'!C51","v":0},{"$f":"'MCC Comparison Summary'!D51","v":0},{"$f":"'MCC Comparison Summary'!E51","v":0}]
[null,{"$f":"'MCC Comparison Summary'!B52","v":"Other Prepaid Finance Charges (excluding Loan Orig. Fee)"},{"$f":"'MCC Comparison Summary'!C52","v":0},{"$f":"'MCC Comparison Summary'!D52","v":0},{"$f":"'MCC Comparison Summary'!E52","v":0}]
[null,{"$f":"'MCC Comparison Summary'!B53","v":"Prepaid/Reserves Deposited with Lender"},{"$f":"'MCC Comparison Summary'!C53","v":0},{"$f":"'MCC Comparison Summary'!D53","v":0},{"$f":"'MCC Comparison Summary'!E53","v":0}]
[null,{"$f":"'MCC Comparison Summary'!B54","v":"MCC Fee"},{"$f":"'MCC Comparison Summary'!C54","v":0},{"$f":"'MCC Comparison Summary'!D54","v":0},{"$f":"'MCC Comparison Summary'!E54","v":675}]
[null,{"$f":"'MCC Comparison Summary'!B55","v":"3rd Party Fees"},{"$f":"'MCC Comparison Summary'!C55","v":0},{"$f":"'MCC Comparison Summary'!D55","v":0},{"$f":"'MCC Comparison Summary'!E55","v":0}]
[null,{"$f":"'MCC Comparison Summary'!B56","v":"Second Mortgage Loan Fees"},{"$f":"'MCC Comparison Summary'!C56","v":0},{"$f":"'MCC Comparison Summary'!D56","v":0},{"$f":"'MCC Comparison Summary'!E56","v":0}]
[null,{"$f":"'MCC Comparison Summary'!B57","v":"Total Loan Fees"},{"$f":"'MCC Comparison Summary'!C57","v":0},{"$f":"'MCC Comparison Summary'!D57","v":0},{"$f":"'MCC Comparison Summary'!E57","v":675}]
[null,{"$f":"'MCC Comparison Summary'!B58","v":"Down Payment from borrowers own funds"},{"$f":"'MCC Comparison Summary'!C58","v":0},{"$f":"'MCC Comparison Summary'!D58","v":0},{"$f":"'MCC Comparison Summary'!E58","v":0}]
[null,{"$f":"'MCC Comparison Summary'!B59","v":"Total Estimated Cost to Close"},{"$f":"'MCC Comparison Summary'!C59","v":0},{"$f":"'MCC Comparison Summary'!D59","v":0},{"$f":"'MCC Comparison Summary'!E59","v":675}]
[]
["How to use your MCC once awarded"]
["We recommend that you consult an accountant or professional financial advisor to help you determine which loan product best meets your short term and long term financial goals. The MCC is of most value to you if you expect to owe federal income taxes today and in future years.  And then only if you file IRS Form 8396 with your federal income tax returns."]
[]
["WHAT NEXT?"]
["Personal, family and financial goals differ and what is right for one homebuyer may not be right for another.  In deciding what loan program is best for you, you need to carefully consider all of your financing options including the impact on your monthly payment, income taxes, and costs over time and upon refinancing or sale of the home.  For more information about the MCC program contact a MCC-Approved Participating Lender or PHB at 503.823.2375. "]
[]
["ACKNOWLEDGEMENT"]
[]
[]
[null,{"$f":"C9","v":" "},null,{"$f":"'MCC Data Input'!E7","v":"00:00:00"}]
[null,{"$f":"'MCC Data Input'!$E$27","v":0},null,"Date"]
[]
[]
[null,null,null,{"$f":"D142","v":"00:00:00"}]
[null,{"$f":"B9","v":" "},null,"Date"]

{"sheet":"MCC Transmittal","index":7,"n_rows":49,"n_cols":11,"rows_kept":49,"cut":false,"hidden":false,"merged":[[42,0,42,11],[5,10,5,11],[9,9,9,11],[10,9,10,11],[5,2,5,5],[6,2,6,5],[7,2,7,5],[9,2,9,5],[7,0,7,1],[16,8,17,11],[26,4,26,11],[28,4,28,11],[10,2,10,5],[15,2,15,5],[16,2,16,5],[6,10,6,11],[1,7,1,11],[3,0,3,11],[20,0,20,11],[5,7,5,9],[11,9,11,11],[12,2,12,5],[13,2,13,5],[11,2,11,5],[12,9,12,11],[13,9,13,11]]}
[]
[null,null,null,null,null,null,null,{"$f":"IF('MCC Comparison Summary'!E16=\"OVER INCOME\",\"OVER INCOME\",\" \")","v":" "}]
[]
["MCC INITIAL APPLICATION TRANSMITTAL FORM"]
[]
[{"$f":"'MCC Data Input'!A7","v":"Disclosure Date"},null,{"$f":"'MCC Data Input'!E7","v":"00:00:00"},null,null,null,null,{"$f":"'MCC Data Input'!A130","v":"Escrow Number"},null,null,{"$f":"+'MCC Data Input'!E130","v":0}]
[{"$f":"'MCC Data Input'!A9","v":"Loan Number"},null,{"$f":"'MCC Data Input'!E9","v":0},null,null,null,null,{"$f":"'MCC Data Input'!A131","v":"Estimated Closing Date"},null,null,{"$f":"'MCC Data Input'!E131","v":"00:00:00"}]
["Loan Amount",null,{"$f":"'MCC Comparison Summary'!E22","v":0}]
[]
["Lender Name",null,{"$f":"'MCC Data Input'!E8","v":0},null,null,null,null,{"$f":"+'MCC Data Input'!A129","v":"Escrow Company"},null,{"$f":"'MCC Data Input'!E129","v":0}]
[{"$f":"'MCC Data Input'!A10","v":"Loan Officer"},null,{"$f":"'MCC Data Input'!E10","v":0},null,null,null,null,{"$f":"'MCC Data Input'!A132","v":"Escrow Agent"},null,{"$f":"'MCC Data Input'!E132","v":0}]
[{"$f":"'MCC Data Input'!H11","v":"Business Phone"},null,{"$f":"'MCC Data Input'!E11","v":0},null,null,null,null,{"$f":"A12","v":"Business Phone"},null,{"$f":"'MCC Data Input'!E133","v":0}]
[{"$f":"'MCC Data Input'!H13","v":"Fax Number"},null,{"$f":"'MCC Data Input'!E13","v":0},null,null,null,null,{"$f":"A13","v":"Fax Number"},null,{"$f":"'MCC Data Input'!E134","v":0}]
[{"$f":"'MCC Data Input'!H14","v":"Email Address"},null,{"$f":"'MCC Data Input'!E14","v":0},null,null,null,null,{"$f":"A14","v":"Email Address"},null,{"$f":"'MCC Data Input'!E135","v":0}]
[]
["Applicant Name",null,{"$f":"'MCC Data Input'!E27","v":0}]
["Co-Applicant Name",null,{"$f":"IF('MCC Data Input'!E28=0,\"None\",+'MCC Data Input'!E28)","v":"None"},null,null,null,null,null,"Information can be submitted via Fax or Email to 503-865-3480 or mcc@portlandoregon.gov"]
[{"$f":"'MCC Data Input'!B39","v":"Property Address"},null,{"$f":"'MCC Data Input'!E39","v":0}]
[null,null,{"$f":"'MCC Data Input'!E40","v":0}]
[]
["THE FOLLOWING DOCUMENTS MUST BE SUBMITTED IN THE INITIAL MCC APPLICATION PACKAGE: (Check each item included in the package, incomplete packages will not be processed)"]
[]
[null,null,null,null,"MCC Initial Application Transmittal Form (form MCC-02)"]
[]
[null,null,null,null,"MCC Disclosure (form MCC-01c) - signed"]
[]
[null,null,null,null,"Printed MCC Data Input Sheet (form MCC-01a)"]
[]
[null,null,null,null,"Printed MCC Comparison Summary (form MCC-01b)"]
[]
[null,null,null,null,"1003 prepared for Underwriting"]
[]
[null,null,null,null,"1008/MCAW prepared for Underwriting"]
[]
[null,null,null,null,"Initial Reg Z and Good Faith Estimate"]
[]
[null,null,null,null,"Application Affidavit (form MCC-03) signed and witnessed"]
[]
[null,null,null,null,"Notice of Potential Recapture Tax (form MCC-05) signed"]
[]
[null,null,null,null,"Executed Purchase and Sale Agreement (copy)"]
[]
["INDIVIDUAL SUBMITTING THIS MCC APPLICATION PACKAGE HAS CONFIRMED THAT THE 1003, 1008 AND MCC DISCLOSURES SHOW THE SAME: (check each to confirm match)"]
[]
[null,null,null,null,"Borrower Income"]
[]
[null,null,null,null,"Sale Price"]
[]
[null,null,null,null,"Loan Amount and terms"]

{"sheet":"MCC Recapture Notice","index":8,"n_rows":35,"n_cols":10,"rows_kept":35,"cut":false,"hidden":false,"merged":[[0,6,0,9],[4,5,6,8],[24,0,24,9],[26,0,26,9],[11,3,11,5],[9,3,9,5],[16,0,16,9],[17,0,17,9],[20,0,20,9],[22,0,22,9]]}
["MAILING ADDRESS",null,null,null,null,null,"MCC NO: _____________________________"]
["Portland Housing Bureau"]
["421 SW 6th Avenue, Suite 500"]
["Portland, OR  97204"]
["TEL: 503-823-2375  FAX: 503-865-3480",null,null,null,null,{"$f":"IF('MCC Comparison Summary'!E16=\"OVER INCOME\",\"OVER INCOME\",\" \")","v":" "}]
["EMAIL:  mcc@portlandoregon.gov"]
[]
[]
[]
["Applicant Name:",null,null,{"$f":"'MCC Data Input'!E27","v":0}]
[]
["Co-Applicant Name:",null,null,{"$f":"IF('MCC Data Input'!E28=0,\" \",+'MCC Data Input'!E28)","v":" "}]
[]
[]
[]
[]
["NOTICE OF POTENTIAL RECAPTURE TAX ON SALE OF HOME"]
["(To be delivered to and signed by the Applicant(s) before a MCC commitment can be issued.)"]
[]
[]
["Because you are receiving a mortgage credit certificate with your mortgage loan, you are receiving the benefit of a credit against your federal income taxes.  If you sell or otherwise dispose of your home during the next nine years, part or all of this benefit may be \"recaptured.\"  The recapture is accomplished by an increase in your federal income tax for the year in which you sell your home.  The recapture only applies, however, if you sell your home at a gain and if your income increases above specified levels."]
[]
["The recapture was enacted in 1988.  According to the United States General Accounting Office, the purpose of the recapture is to retrieve the subsidy from owners who experience repaid income increases after purchase of their home and, as a result, do not need the subsidy to remain homeowners.  If you income does not increase more than 5 percent per year, you will likely not incur a recapture liability."]
[]
["You may wish to consult a tax advisor or the local office of the Internal Revenue Service at the time you sell your home to determine the amount, if any, of your actual recapture tax (see Section 143(m) of the Internal Revenue Code for details.)  Along with this notice, you are being given additional information that will be needed to calculate the recapture tax."]
[]
["The undersigned Applicant(s) has (have) received and read a duplicate copy of the foregoing Notice of Potential Recapture Tax on Sale of Home."]
[]
["Date:"]
[null,null,null,null,null,{"$f":"'MCC Data Input'!E27","v":0},null,null,null,"(Applicant)"]
[]
[]
[]
["Date:"]
[null,null,null,null,null,{"$f":"IF('MCC Data Input'!E28=0,\" \",+'MCC Data Input'!E28)","v":" "},null,null,null,"(Co-Applicant)"]

{"sheet":"MCC Application Affidavit","index":9,"n_rows":170,"n_cols":10,"rows_kept":170,"cut":false,"hidden":false,"merged":[[160,1,160,9],[162,1,162,9],[158,0,158,9],[169,0,169,6],[8,0,8,9],[10,0,10,9],[11,0,11,9],[13,0,13,9],[152,0,152,9],[141,0,141,9],[143,0,143,9],[131,0,131,9],[58,1,58,3],[58,5,58,6],[58,8,58,9],[60,1,60,3],[32,1,32,9],[43,1,43,9],[45,1,45,9],[47,1,47,9],[49,1,49,9],[51,1,51,9],[66,5,66,6],[69,5,69,6],[69,8,69,9],[71,5,71,6],[52,1,52,9],[54,1,54,9],[56,1,56,9],[59,5,59,6],[59,8,59,9],[61,5,61,6],[60,5,60,6],[63,1,63,3],[63,5,63,6],[63,8,63,9],[65,1,65,3],[65,5,65,6],[64,5,64,6],[64,8,64,9],[73,1,73,9],[80,1,80,3],[68,1,68,3],[68,5,68,6],[68,8,68,9],[70,1,70,3],[70,5,70,6],[102,1,102,9],[75,5,75,8],[77,5,77,8],[80,5,80,8],[90,1,90,9],[82,1,82,3],[85,1,85,3],[87,1,87,3],[75,1,75,3],[77,1,77,3],[94,1,94,9],[101,6,101,9],[3,5,4,8],[156,0,156,9],[166,0,166,3],[97,4,97,6],[119,2,119,3],[120,2,120,3],[82,5,82,8],[87,5,87,8],[85,5,85,8],[116,1,116,9],[118,2,118,3],[118,4,118,5],[96,4,96,6],[108,1,108,9],[135,0,135,3],[139,0,139,3],[29,5,29,6],[130,1,130,9],[119,4,119,5],[120,4,120,5],[124,2,124,3],[128,1,128,9],[40,1,40,6],[99,1,99,9],[93,2,93,3],[104,2,104,3],[92,1,92,9],[96,1,96,3],[97,1,97,3],[114,1,114,9],[110,1,110,9],[112,1,112,9]]}
["MAILING ADDRESS",null,null,null,null,null,null,null,null,"MCC NO: _______________________"]
["Portland Housing Bureau"]
["421 SW 6th Avenue, Suite 500"]
["Portland, OR  97204",null,null,null,null,{"$f":"IF('MCC Comparison Summary'!E16=\"OVER INCOME\",\"OVER INCOME\",\" \")","v":" "}]
["Phone - 503-823-2375  Fax 503-865-3480"]
["Email:  mcc@portlandoregon.gov"]
[]
[]
["APPLICATION AFFIDAVIT"]
[]
["THERE ARE IMPORTANT LEGAL CONSEQUENCES TO THIS LEGAL AFFIDAVIT."]
["READ IT CAREFULLY BEFORE SIGNING"]
[]
["I (We) the undersigned, as part of my (our) application for a mortgage credit certificate (\"MCC\") from the City of Portland through the Portland Housing Bureau (\"PHB”), issuer of such certificates under the PHB’s Mortgage Credit Certificate Program (the \"Program\"), and as a material inducement to the PHB  to issue such certificate to the undersigned in connection with the financing with a mortgage loan (the \"Mortgage Loan\") from a lender of the undersigned's choosing (the \"Lender\"), for the undersigned's purchase of a single-family home (the \"Residence\"), being first duly sworn, state the following:"]
[]
["1.","I (We) certify that the following are:"]
[]
[null,"a.",{"$f":"'MCC Data Input'!E27","v":0}]
[null,null,"Applicant"]
[]
[null,null,{"$f":"IF('MCC Data Input'!E28=0,\" \",+'MCC Data Input'!E28)","v":" "}]
[null,null,"Co-Applicant"]
[]
[null,"b.",{"$f":"'MCC Data Input'!E98","v":0}]
[null,null,"Current Residence"]
[]
[null,null,{"$f":"'MCC Data Input'!E99","v":0}]
[null,null,"City/State/Zip"]
[]
[null,"c.",{"$f":"'MCC Data Input'!E95","v":0},null,null,{"$f":"'MCC Data Input'!E96","v":0}]
[null,null,"Home Phone",null,null,"Work Phone"]
[]
["2.","The Residence being purchased is a single-family home located within the limits of the City of Portland at the following address:"]
[]
[null,null,{"$f":"'MCC Data Input'!E39","v":0}]
[null,null,"Property Address"]
[]
[null,null,{"$f":"'MCC Data Input'!E40","v":0}]
[null,null,"City/State/Zip"]
[]
[null,"CHECK HERE IF PROPERTY IS LOCATED WITHIN A TARGET AREA:",null,null,null,null,null,{"$f":"IF('MCC Data Input'!E41=\"No\",\" \",\"X\")","v":" "}]
[null,"If so, map showing location of property must accompany this document."]
[]
["3.","I (We) certify that the Residence will be occupied and used as my (our) principal place of residence within sixty (60) days after the date of the Mortgage Loan Closing. I (We) certify that the Residence will not be used as an investment property, vacation home, or recreational home and that not more than fifteen (15%) percent of the area of the Residence will be used in a trade or business. I (We) certify that I (we) will notify the PHB in writing if the residence ceases to be my (our) principal Residence."]
[]
["4.","If the loan application is for a loan on a newly constructed home, I (we) certify that the Residence has not and will not be occupied prior to loan commitment."]
[]
["5.","(We) understand and agree that I(we) will pay a fee of $675.00 to PHB as the administrator of the Program."]
[]
["6.","If the Residence is newly constructed, I (we) certify that the proceeds of the Mortgage Loan will not be used to replace an existing mortgage unless the existing mortgage is for: (1) a construction period loan of not greater than 24 months, or (2) a bridge loan or similar temporary initial financing of 24 months or less. If the Residence is a previously occupied home, I (we) certify that the proceeds of the Mortgage Loan will not be used to replace my (our) existing mortgage."]
[]
["7.","PLEASE NOTE, IF PURCHASING IN A DESIGNATED TARGET AREA, THIS REQUIREMENT IS WAIVED."]
[null,"I (We) understand that I (we) am (are) not eligible for an MCC from the PHB under this program if I (we) individually or together had an ownership interest in a principal residence within three years prior to the date this application affidavit was signed and witnessed below."]
[]
[null,"I (We) also understand that I (we) cannot have an ownership interest in a principal residence between the date of application and closing. For this purpose, a principal residence includes a single-family residence, condominium, share in a housing cooperative, any manufactured home or mobile home (as defined under federal and state law), or occupancy in a multifamily residence owned by me (us). For this purpose, an ownership interest means ownership by any means, whether outright or partial, including property subject to mortgage or other security interest. An ownership interest also means a fee simple ownership interest, a joint ownership interest by joint tenancy, tenancy in common, or tenancy by the entirety, or a life estate interest. I (We) certify that I (we) have listed below all places of residence, whether owned or not, for a three-year period prior to the date this application affidavit was signed and witnessed below."]
[]
[null,"Previous Residences Over the Preceding Three-year Period (add addendum if more space is needed.)"]
[]
["a.",{"$f":"'MCC Data Input'!E98","v":0},null,null,null,{"$f":"'MCC Data Input'!E102","v":"00:00:00"},null,null,{"$f":"'MCC Data Input'!G102","v":"00:00:00"}]
[null,"Current Address",null,null,null,"Beginning",null,null,"Ending Dates of Residency"]
[null,{"$f":"'MCC Data Input'!E99","v":0},null,null,null,{"$f":"'MCC Data Input'!E100","v":"Rent"}]
[null,"City/State/Zip",null,null,null,"Own/Rent"]
[]
["b.",{"$f":"'MCC Data Input'!E108","v":0},null,null,null,{"$f":"IF('MCC Data Input'!E112=0,\"NA\",+'MCC Data Input'!E112)","v":"NA"},null,null,{"$f":"IF('MCC Data Input'!G112=0,\"NA\",+'MCC Data Input'!G112)","v":"NA"}]
[null,"Previous Address",null,null,null,"Beginning",null,null,"Ending Dates of Residency"]
[null,{"$f":"'MCC Data Input'!E109","v":0},null,null,null,{"$f":"'MCC Data Input'!E110","v":"Rent"}]
[null,"City/State/Zip",null,null,null,"Own/Rent"]
[]
["c.",{"$f":"'MCC Data Input'!E118","v":0},null,null,null,{"$f":"IF('MCC Data Input'!E122=0,\"NA\",+'MCC Data Input'!E122)","v":"NA"},null,null,{"$f":"IF('MCC Data Input'!G122=0,\"NA\",+'MCC Data Input'!G122)","v":"NA"}]
[null,"Previous Address",null,null,null,"Beginning",null,null,"Ending Dates of Residency"]
[null,{"$f":"'MCC Data Input'!E119","v":0},null,null,null,{"$f":"'MCC Data Input'!E120","v":"Rent"}]
[null,"City/State/Zip",null,null,null,"Own/Rent"]
[]
[null,"Name, Address and Telephone of the Owner or Landlord Who Can Verify Each Residence Listed Above Which Was Not Owned by the Applicant  (add addendum if more space is needed.)"]
[]
["d.",{"$f":"'MCC Data Input'!E103","v":0},null,null,null,{"$f":"'MCC Data Input'!E104","v":0}]
[null,"Landlord Name",null,null,null,"Address"]
[null,{"$f":"'MCC Data Input'!E106","v":0},null,null,null,{"$f":"'MCC Data Input'!E105","v":0}]
[null,"Phone",null,null,null,"City/State/Zip"]
[]
["e.",{"$f":"'MCC Data Input'!E113","v":0},null,null,null,{"$f":"'MCC Data Input'!E114","v":0}]
[null,"Landlord Name",null,null,null,"Address"]
[null,{"$f":"'MCC Data Input'!E116","v":0},null,null,null,{"$f":"'MCC Data Input'!E115","v":0}]
[null,"Phone",null,null,null,"City/State/Zip"]
[]
["f.",{"$f":"'MCC Data Input'!E123","v":0},null,null,null,{"$f":"'MCC Data Input'!E124","v":0}]
[null,"Landlord Name",null,null,null,"Address"]
[null,{"$f":"'MCC Data Input'!E126","v":0},null,null,null,{"$f":"'MCC Data Input'!E125","v":0}]
[null,"Phone",null,null,null,"City/State/Zip"]
[]
["8.","I (We) certify that I (we) am (are) required to and will hereby submit true and complete copies of my (our) actual signed federal tax returns as filed for the preceding three (3) tax years or such other written verification that is acceptable to the MCC Program."]
[]
["9.","I (We) certify that the total purchase price of the residence and land as a completed residence, including all construction items, all commissions, all builder's fees, hook-up and tap-in fees, permits, architectural fees, all site improvements, discount points paid by the seller, work credit,   subcontracted items, or construction loan interest, but excluding any closing costs and permanent financing charges will be:"]
[null,"$",{"$f":"'MCC Data Input'!E46","v":0}]
[null,"(sales price including all fees but excluding closing costs and permanent finance cost) and will not exceed the purchase price limitation applicable to the Residence appearing in the following schedule:"]
[]
[null,"Purchase Price Limit",null,null,"Indicate if house is:"]
[null,424051,null,null,"New Construction",null,null,{"$f":"IF('MCC Data Input'!E42=\"New Construction\",\"X\",\" \")","v":" "}]
[]
["10.","I (We) certify that the amount listed in paragraph 9 of this affidavit is (i) the sole payment by the buyer and there are no payments to be made by related persons or for the benefit of the buyer and (ii) the residence is not being purchased subject to ground rent. "]
[]
["11.","I (We) certify that the residence :",null,null,null,{"$f":"IF('MCC Data Input'!E42=\"Existing\",\"has\",+'MCC Data Input'!E43)","v":0},"been completely constructed.  If the "]
[null,"residence has not been completely constructed, my estimate for the reasonable cost of completing the residence is:"]
[]
[null,"$",{"$f":"'MCC Data Input'!E44","v":0}]
[]
["12.","I (We) certify that the Certified Indebtedness (mortgage amount) is:",null,null,null,null,null,null,null,{"$f":"'MCC Comparison Summary'!E22","v":0}]
[]
["13.","I (We) further certify that no side deal or agreement, either verbal or written, is presently contemplated for the completion of or the addition to this Residence unless the estimated cost of the completion and/or addition is included in the purchase price."]
[]
["14.","I (We) certify that no portion of the financing of the acquisition of this Residence is or will be provided from the proceeds of a qualified mortgage bond or a qualified veteran's mortgage bond.  No person related to me (as defined in applicable federal or state laws and regulations) has or is expected to have an interest as a creditor in the Mortgage Loan being acquired for the Residence."]
[]
["15.","I (We) understand and agree that if an MCC is issued to me (us), it may not be transferred unless (i) the home is purchased by an eligible MCC applicant (the \"Transferee\"), (ii) the Transferee assumes the remaining certified indebtedness (mortgage, and (iii) PHB issues a new certificate to the Transferee."]
[]
["16.","I (We) understand and agree that I (we) may seek financing from any lender of my (our) choosing and that I (we) am (are) in no way prohibited from seeking financing from any potential lender, so long as the lender agrees to execute and comply with the terms and conditions of the PHB Lender Participation Agreement."]
[]
["17.","I (We) understand that I (we) am (are) not eligible for an MCC unless my (our) gross annual income* does not exceed:"]
[]
[null,null,"Household Size",null,"Income Limit"]
[null,null,"1 - 2",null,{"$f":"'Recapture Calculator'!B50","v":73000}]
[null,null,"3 or more",null,{"$f":"'Recapture Calculator'!C50","v":83950}]
[]
["18.","I (We) certify that my (our) current gross annual income* as defined below is:"]
[]
[null,"$",{"$f":"'MCC Data Input'!E30","v":0},null,"and"]
[]
[null,"THE NUMBER OF PERSONS IN THE HOUSEHOLD IS:",null,null,null,null,{"$f":"'MCC Data Input'!E29","v":0}]
[]
["19.","I (We) acknowledge and understand that this Affidavit will be relied upon for purposes of determining my (our) eligibility for an MCC.  I (We) acknowledge and understand that all statements made in this affidavit are under penalty of perjury and that any fraudulent statement will result in (i) the revocation of the individual's (buyer's) mortgage credit certificate and (ii) a $10,000 penalty under Internal Revenue Code Section 6709.  I (We) acknowledge that a material misstatement negligently made in this affidavit or in any other statement made by me (us) in connection with an application for an MCC will constitute a federal violation punishable by a fine; and a material misstatement fraudulently made in this affidavit or in any other statement made by me (us) in connection with application for an MCC, will constitute a federal violation punishable by a fine and revocation of the Certificate, which may be in addition to any criminal penalty imposed by law.  In addition, any material misstatement or false statement which affects my (our) eligibility for an MCC will result in a denial of my (our) application for an MCC, or, if an MCC has been issued prior to discovery of the false statement, immediate cancellation of the MCC issued."]
[]
["20.","In addition, I (we) hereby acknowledge and understand that any false pretense, including any false statement or representation or the fraudulent use of any instrument, facility, article, or other valuable thing or service pursuant to my (our) participation in any Portland Housing Bureau program, is punishable by imprisonment or by a fine."]
["APPLICANT ACKNOWLEGDEMENT"]
[]
[]
[]
[{"$f":"'MCC Data Input'!E27","v":0},null,null,null,null,"Date",null,null,"Enter Social Security Number"]
[]
[]
[]
[{"$f":"'MCC Data Input'!E28","v":0},null,null,null,null,"Date",null,null,"Enter Social Security Number"]
[]
["APPLICANTS SIGNATURE MUST BE NOTARIZED OR ACKNOWLEDGED BY TWO WITNESSES"]
[]
["I certify that I personally witnessed the above named applicant and co-applicant execute this Application Affidavit."]
[]
[]
[]
["WITNESS 1",null,null,null,null,"Date"]
[]
[]
["WITNESS 2",null,null,null,null,"Date"]
[]
["LENDER'S CERTIFICATION"]
[]
["Name of Lender:",null,null,{"$f":"'MCC Data Input'!E8","v":0}]
[]
["The lender hereby certifies that to the best of its knowledge and belief each of the foregoing statements is true and correct and each of them is consistent with the information submitted by the applicant(s) in connection with his/her application for a loan."]
[]
["Lender further certifies that (check the following statement that correctly applies to this application) (Requirement is waived if purchasing in a Target Area):"]
[]
["£","The Lender has been furnished with said tax returns or verifications and certification that the applicant has met the three (3) year principal residence non-ownership requirement."]
[]
["£","The Lender has not been furnished with said tax returns or verification and certification that the applicant has met the (3) year Principal residence non-ownership requirements, and the Commitment is conditioned upon receipt of said returns or acceptable verification and certification."]
[]
[]
[]
[{"$f":"'MCC Data Input'!E10","v":0},null,null,null,null,"Date"]
[{"$f":"'MCC Data Input'!A10","v":"Loan Officer"}]
[]
["\"Gross Income\" of a mortgagor(s) as defined by IRS Revenue Ruling 86-124 is the mortgagor's annualized gross income.  Annualized gross income is the product of monthly income multiplied by 12.  See Appendix A of the MCC program manual for more detailed guidelines."]

{"sheet":"Sheet1","index":10,"n_rows":0,"n_cols":0,"rows_kept":0,"cut":false,"hidden":false,"merged":[]}