{"text_format":"1","workbook":"xlsx","n_sheets":11,"sheets":["Instructions","MCC Data Input","MCC Comparison Summary","APR Calculations","Recapture Calculator","2010 Tax Table and deducts","MCC Disclosure","MCC Transmittal","MCC Recapture Notice","MCC Application Affidavit","Sheet1"],"not_rendered":{"charts":1,"images":11,"macros":1,"external_links":0,"defined_names":8,"comments":0,"pivot_tables":0},"unopened":[],"bounds":{"document_bytes":16777216,"sheet_cells":100000,"rows_first":2000,"rows_last":500,"rows_between":2000,"halvings":0,"cell_chars":16384,"cell_head_chars":4096},"cells_cut":0,"cells_raw":0,"read":"whole","date_system":"1900"}

{"sheet":"Instructions","index":0,"n_rows":130,"n_cols":9,"rows_kept":130,"cut":false,"hidden":false,"merged":[[120,1,120,10],[6,2,6,10],[8,2,8,10],[2,0,2,10],[12,1,12,10],[14,1,14,10],[24,1,24,10],[41,1,41,10],[65,1,65,10],[63,1,63,10],[84,1,84,10],[103,1,103,10]]}
["CITY OF PORTLAND - MCC PROGRAM CALCULATOR INSTRUCTIONS"]
[]
["This Mortgage Credit Certificate (MCC) Comparison Spreadsheet is designed to help MCC Certified Loan Officers evaluate whether the MCC Program is the right product for their clients. The information provided is estimates only and requires the skill of a lending professional to evaluate and interpret the resulting outputs.  It is not intended for use by the general public. For more information about the City of Portland's MCC program and the eligibility requirements, please visit www.pdc.us/mcc."]
[]
["PURPOSE OF THIS WORKBOOK"]
[]
[null,"1.","To help MCC Certified Loan Officers evaluate whether the MCC program is the best product for their clients; and"]
[]
[null,"2.","To facilitate completion of the unique MCC forms that PDC requires prior to issuing an MCC Commitment"]
[]
["GETTING STARTED"]
[]
[null,"This workbook uses macros to automate the spreadsheet and make it easier to print the individual forms and disclosures required for submission of an application to PDC for approval.  Your system must be set to allow macros to run on your computer for these functions to work properly on your computer. "]
[]
[null,"When you first open this workbook, you will likely see a security warning at the bottom of the ribbon. Click \"Options\" to move to the screen that will allow you to enable macros. "]
[]
[]
[]
[]
[]
{"$rows_left_out":111}
{"sheet":"MCC Data Input","index":1,"n_rows":173,"n_cols":8,"rows_kept":173,"cut":false,"hidden":false,"merged":[[11,4,11,6],[135,4,135,6],[136,4,136,6],[81,0,81,2],[14,4,14,6],[39,4,39,6],[94,4,94,6],[132,4,132,6],[133,4,133,6],[129,4,129,6],[128,4,128,6],[130,4,130,6],[131,4,131,6],[134,4,134,6],[125,4,125,6],[102,4,102,6],[9,4,9,6],[10,4,10,6],[12,4,12,6],[13,4,13,6],[38,4,38,6],[24,0,24,8],[37,0,37,8],[34,1,34,2],[19,4,19,6],[26,4,26,8],[27,4,27,8],[16,4,16,6],[17,4,17,6],[18,4,18,6],[21,4,21,6],[22,4,22,6],[7,4,7,6],[8,4,8,6],[0,0,0,8],[1,0,1,8],[5,0,5,8],[2,6,2,8],[3,0,3,8],[127,0,127,8],[103,4,103,6],[104,4,104,6],[105,4,105,6],[107,4,107,6],[108,4,108,6],[123,4,123,6],[124,4,124,6],[96,4,96,6],[95,4,95,6],[52,0,52,8],[73,0,73,8],[122,4,122,6],[112,4,112,6],[113,4,113,6],[114,4,114,6],[115,4,115,6],[117,4,117,6],[118,4,118,6],[97,4,97,6],[98,4,98,6],[41,1,41,2],[38,1,38,2],[93,0,93,8],[80,0,80,8],[43,1,43,2],[44,1,44,2],[42,1,42,2],[33,6,33,8],[15,4,15,6],[20,4,20,6],[39,1,39,2],[40,1,40,2]]}
["Mortgage Credit Certificate Program"]
["Product Comparison Data Input"]
[null,null,null,null,null,null,{"$f":"IF('MCC Comparison Summary'!E16=\"OVER INCOME\",\"OVER INCOME\",\" \")","v":" "}]
["* Field required to complete pre-qualification comparison.  However, all fields must be completed to properly populate forms required for submission to PHB for commitment."]
[]
["LENDER INFORMATION"]
["Disclosure Date",null,null,"*"]
["Lender",null,null,"*"]
["Loan Number"]
["Loan Officer",null,null,"*"]
["Loan Officer Contact Information",null,null,null,null,null,null,"Business Phone"]
[null,null,null,null,null,null,null,"Cell Phone"]
[null,null,null,null,null,null,null,"Fax Number"]
[null,null,null,null,null,null,null,"Email Address"]
[null,null,null,null,null,null,null,"Mailing Address"]
[null,null,null,null,null,null,null,"City/State/Zip"]
["Loan Processor"]
["Loan Processor Contact Information",null,null,null,null,null,null,"Business Phone"]
[null,null,null,null,null,null,null,"Cell Phone"]
[null,null,null,null,null,null,null,"Fax Number"]
{"$rows_left_out":154}
{"sheet":"MCC Comparison Summary","index":2,"n_rows":79,"n_cols":7,"rows_kept":79,"cut":false,"hidden":false,"merged":[[3,2,3,3],[7,2,7,4],[6,0,6,1],[5,2,5,4],[0,0,0,4],[3,0,3,1],[4,2,4,3],[1,0,1,4],[78,0,78,4],[73,0,73,1],[59,0,59,1],[16,0,16,1],[9,0,9,1],[48,0,48,1],[27,0,27,1],[43,0,43,1],[33,0,33,1],[71,0,71,1]]}
["City of Portland Mortgage Credit Certificate Program"]
["Loan Product Comparison"]
[]
["Applicant(s) Name",null,"Disclosure Date"]
[null,{"$f":"'MCC Data Input'!E27","v":0},{"$f":"'MCC Data Input'!E7","v":"00:00:00"}]
[null,{"$f":"IF('MCC Data Input'!E28>0,+'MCC Data Input'!E28,\" \")","v":" "},{"$f":"IF(E16=\"OVER INCOME\",\"OVER INCOME\",\" \")","v":" "}]
["Lender Name",null,"Prepared By:"]
[null,{"$f":"'MCC Data Input'!E8","v":0},{"$f":"'MCC Data Input'!E10","v":0}]
[]
["HOMEBUYER INFORMATION",null,"Oregon Bond","Traditional Loan","MCC"]
[1,"IRS Filing Status",{"$f":"+'MCC Data Input'!E32","v":0},{"$f":"C11","v":0},{"$f":"C11","v":0}]
[{"$f":"A11+1","v":2},"Number of  Exemptions for Income Tax Purposes",{"$f":"IF(C11=\"MARRIED FILING JOINTLY\",2, 1)","v":1},{"$f":"+C12","v":1},{"$f":"+C12","v":1}]
[{"$f":"A12+1","v":3},"Number of Children Under 17",{"$f":"'MCC Data Input'!E33","v":0},{"$f":"+C13","v":0},{"$f":"+C13","v":0}]
[{"$f":"A13+1","v":4},"Other Dependents for Income Tax Purposes",{"$f":"'MCC Data Input'!E34","v":0},{"$f":"C14","v":0},{"$f":"D14","v":0}]
[{"$f":"A14+1","v":5},"Family Size",{"$f":"C14+C13+C12","v":1},{"$f":"D14+D13+D12","v":1},{"$f":"E14+E13+E12","v":1}]
[{"$f":"A15+1","v":6},{"$f":"'MCC Data Input'!B30","v":"Homebuyer(s) Gross Annual Income"},{"$f":"IF('MCC Data Input'!E30>'Recapture Calculator'!D38,\"OVER INCOME\",+'MCC Data Input'!E30)","v":0},{"$f":"'MCC Data Input'!E30","v":0},{"$f":"IF('MCC Data Input'!E30>'Recapture Calculator'!D37,\"OVER INCOME\",+'MCC Data Input'!E30)","v":0},"MCC","Bond"]
["SALE AND FIRST MORTGAGE LOAN ASSUMPTIONS",null,{"$f":"$C$10","v":"Oregon Bond"},{"$f":"$D$10","v":"Traditional Loan"},{"$f":"$E$10","v":"MCC"}]
[{"$f":"A16+1","v":7},"Sales Price",{"$f":"'MCC Data Input'!E46","v":0},{"$f":"$C18","v":0},{"$f":"$C18","v":0}]
[{"$f":"A18+1","v":8},"Amount of Second Mortgage used for Purchase",{"$f":"C29*'MCC Data Input'!E71","v":0},{"$f":"'MCC Data Input'!G66*'MCC Data Input'!G71","v":0},{"$f":"D19","v":0}]
[9,"Borrower Down Payment",{"$f":"C18*'MCC Data Input'!E47","v":0},{"$f":"D18*'MCC Data Input'!G47","v":0},{"$f":"D20","v":0}]
{"$rows_left_out":60}
{"sheet":"APR Calculations","index":3,"n_rows":391,"n_cols":27,"rows_kept":391,"cut":false,"hidden":true,"merged":[]}
["APR analysis",null,"Bond","Market","MCC"]
["Loan Amount",null,{"$f":"E2","v":0},{"$f":"C2","v":0},{"$f":"'MCC Comparison Summary'!C22","v":0}]
["Interest Rate",null,{"$f":"'MCC Comparison Summary'!C23","v":0},{"$f":"'MCC Comparison Summary'!D23","v":0},{"$f":"D3","v":0}]
["Mortgage Insurance Rate",null,{"$f":"'MCC Comparison Summary'!C24","v":0},{"$f":"'MCC Comparison Summary'!D24","v":0},{"$f":"'MCC Comparison Summary'!E24","v":0}]
["Term",null,{"$f":"E5","v":360},{"$f":"C5","v":360},360]
["Monthly P&I Pmt",null,{"$f":"-PMT(C3/12,C5,C2)","v":0},{"$f":"-PMT(D3/12,D5,D2)","v":0},{"$f":"-PMT(E3/12,E5,E2)","v":0}]
["Mortgage Insurance Premium",null,{"$f":"'MCC Comparison Summary'!C39","v":0},{"$f":"'MCC Comparison Summary'!D39","v":0},{"$f":"'MCC Comparison Summary'!E39","v":0}]
["Total PIMI Pmt",null,{"$f":"SUM(C6:C7)","v":0},{"$f":"SUM(D6:D7)","v":0},{"$f":"SUM(E6:E7)","v":0}]
[]
["Points - %",null,{"$f":"'MCC Comparison Summary'!C50","v":0},{"$f":"'MCC Comparison Summary'!D50","v":0},{"$f":"'MCC Comparison Summary'!D50","v":0}]
["Points - $",null,{"$f":"C2*C10","v":0},{"$f":"D2*D10","v":0},{"$f":"E2*E10","v":0}]
["Other Finance Charges",null,{"$f":"'MCC Comparison Summary'!C52","v":0},{"$f":"'MCC Comparison Summary'!D52","v":0},{"$f":"'MCC Comparison Summary'!E52+'MCC Comparison Summary'!E54","v":675}]
["Total Prepaid Finance Charges",null,{"$f":"SUM(C11:C12)","v":0},{"$f":"SUM(D11:D12)","v":0},{"$f":"SUM(E11:E12)","v":675}]
["Amount Financed",null,{"$f":"C2-C13","v":0},{"$f":"D2-D13","v":0},{"$f":"E2-E13","v":-675}]
["Mortgage Insurance (125 mos)",null,{"$f":"(($C$2*$C$4)/12)*125","v":0},{"$f":"(($D$2*$D$4)/12)*125","v":0},{"$f":"(($E$2*$E$4)/12)*125","v":0}]
["Mortgage Interest Paid",null,{"$f":"D27","v":0},{"$f":"J27","v":0},{"$f":"P27","v":0}]
["Total Finance Charge",null,{"$f":"C13+C15+C16","v":0},{"$f":"D13+D15+D16","v":0},{"$f":"E13+E15+E16","v":675}]
["Total Payments",null,{"$f":"C17+C2-C13","v":0},{"$f":"D17+D2-D13","v":0},{"$f":"E17+E2-E13","v":0}]
["MCC Credit ",null,0,null,0.2]
["APR",null,{"$f":"RATE(C5,(((-C8*125)+(-C6*235))/360),(C2-C13))*12","v":{"$error":"#NUM!"}},{"$f":"RATE(D5,(((-D8*125)+(-D6*235))/360),(D2-D13))*12","v":{"$error":"#NUM!"}},{"$f":"RATE($E$5,(((-$E$8*125)+(-$E$6*235))/360),($E$2-$E$13))*12","v":{"$error":"#NUM!"}},"Ave. Mo MCC"]
{"$rows_left_out":372}
{"sheet":"Recapture Calculator","index":4,"n_rows":97,"n_cols":9,"rows_kept":97,"cut":false,"hidden":true,"merged":[[14,1,14,5],[59,0,59,5],[0,0,0,6],[1,0,1,6],[2,0,2,6]]}
["Portland Housing Bureau"]
["Mortgage Credit Certificate"]
["Recapture Tax Estimator"]
[]
["Homeowner Inputs"]
[]
[null,"What was your original loan amount?",null,null,null,null,{"$f":"'MCC Comparison Summary'!C22","v":0}]
[]
[null,"Date you purchased the home.",null,null,null,null,{"$f":"'MCC Data Input'!E7","v":"00:00:00"}]
[null,"Date you intent to sell the home.",null,null,null,null,{"$f":"G9+('MCC Data Input'!G75*365)","v":"00:00:00"}]
[null,"Years of Ownership",null,null,null,null,{"$f":"((YEAR(G10)-YEAR(G9))*12+MONTH(G10)-MONTH(G9))/12","v":0}]
[]
[null,"Number of People in the Household at time of Sale?",null,null,null,null,{"$f":"'MCC Data Input'!G77","v":0}]
[]
[null,"Estimated adjusted gross income (less gains on sale of the subject property) in the year the home is sold?",null,null,null,null,{"$f":"'MCC Data Input'!G76","v":0}]
[]
["Estimated Recapture Tax"]
[]
[null,"Estimated Sale Price",null,null,null,{"$f":"-FV('MCC Data Input'!G78,'MCC Data Input'!G75,0,'MCC Data Input'!E46,0)","v":0}]
[null,"Costs of Sale",null,null,null,{"$f":"F19*'MCC Data Input'!G79","v":0}]
{"$rows_left_out":78}
{"sheet":"2010 Tax Table and deducts","index":5,"n_rows":4009,"n_cols":13,"rows_kept":4009,"cut":false,"hidden":true,"merged":[]}
[null,"LOOKUPS"]
[null,"SINGLE",{"$f":"VLOOKUP('MCC Comparison Summary'!C$65,Single,3)","v":{"$error":"#N/A"}},{"$f":"VLOOKUP('MCC Comparison Summary'!D$65,Single,3)","v":{"$error":"#N/A"}},{"$f":"VLOOKUP('MCC Comparison Summary'!E$65,Single,3)","v":{"$error":"#N/A"}},"Deductions",3650]
[null,"MARRIED FILING JOINTLY",{"$f":"VLOOKUP('MCC Comparison Summary'!C$65,Married,3)","v":{"$error":"#N/A"}},{"$f":"VLOOKUP('MCC Comparison Summary'!D$65,Married,3)","v":{"$error":"#N/A"}},{"$f":"VLOOKUP('MCC Comparison Summary'!E$65,Married,3)","v":{"$error":"#N/A"}},"Child Tax Credit",1000]
[null,"HEAD OF HOUSEHOLD",{"$f":"VLOOKUP('MCC Comparison Summary'!C$65,Head_of_Household,3)","v":{"$error":"#N/A"}},{"$f":"VLOOKUP('MCC Comparison Summary'!D$65,Head_of_Household,3)","v":{"$error":"#N/A"}},{"$f":"VLOOKUP('MCC Comparison Summary'!E$65,Head_of_Household,3)","v":{"$error":"#N/A"}}]
[]
[null,null,"SINGLE",null,null,"MARRIED FILING JOINTLY",null,null,null,"HEAD OF HOUSEHOLD"]
[null,null,"Tax Rate","Tax "]
[null,"AGI","% Rate","Tax","Chg","AGI","% Rate","Tax","Chg","AGI","% Rate","Tax","Chg"]
[null,0,0,0,0,0,0,0,0,0,0,0,0]
[null,25,0.1,{"$f":"+B10*C10","v":2.5},{"$f":"+D10-D9","v":2.5},25,0.1,{"$f":"+F10*G10","v":2.5},{"$f":"+H10-H9","v":2.5},25,0.1,{"$f":"+J10*K10","v":2.5},{"$f":"+L10-L9","v":2.5}]
[null,50,0.1,5,2.5,50,0.1,5,2.5,50,0.1,5,2.5]
[null,75,0.1,7.5,2.5,75,0.1,7.5,2.5,75,0.1,7.5,2.5]
[null,100,0.1,10,2.5,100,0.1,10,2.5,100,0.1,10,2.5]
[null,125,0.1,12.5,2.5,125,0.1,12.5,2.5,125,0.1,12.5,2.5]
[null,150,0.1,15,2.5,150,0.1,15,2.5,150,0.1,15,2.5]
[null,175,0.1,17.5,2.5,175,0.1,17.5,2.5,175,0.1,17.5,2.5]
[null,200,0.1,20,2.5,200,0.1,20,2.5,200,0.1,20,2.5]
[null,225,0.1,22.5,2.5,225,0.1,22.5,2.5,225,0.1,22.5,2.5]
[null,250,0.1,25,2.5,250,0.1,25,2.5,250,0.1,25,2.5]
[null,275,0.1,27.5,2.5,275,0.1,27.5,2.5,275,0.1,27.5,2.5]
{"$rows_left_out":3990}
{"sheet":"MCC Disclosure","index":6,"n_rows":147,"n_cols":5,"rows_kept":147,"cut":false,"hidden":false,"merged":[[3,0,3,4],[10,0,10,4],[12,1,12,4],[13,1,13,4],[14,1,14,4],[18,0,18,4],[15,1,15,4],[4,0,4,4],[20,0,20,4],[22,1,22,4],[7,2,7,3],[8,2,9,4],[29,0,29,4],[31,0,31,4],[33,0,33,4],[35,0,35,1],[93,0,93,4],[47,0,47,4],[49,0,49,1],[66,0,66,4],[68,1,68,4],[70,1,70,4],[69,1,69,4],[65,0,65,4],[63,0,63,4],[72,0,72,4],[74,1,74,4],[95,0,95,1],[102,0,102,4],[104,0,104,1],[116,0,116,4],[75,0,75,4],[85,0,85,1],[83,0,83,4],[88,0,88,4],[91,0,91,4],[141,3,141,4],[145,3,145,4],[133,0,133,4],[136,0,136,4],[118,0,118,4],[120,0,120,1]]}
[]
[]
[]
["Is the Mortgage Credit Certificate right for Me?"]
[]
[]
["Applicant(s) Name:",null,"Disclosure Date:"]
[null,{"$f":"'MCC Data Input'!$E$27","v":0},{"$f":"'MCC Data Input'!E7","v":"00:00:00"}]
[null,{"$f":"IF('MCC Data Input'!E28>0,'MCC Data Input'!E28,\" \")","v":" "},{"$f":"IF('MCC Comparison Summary'!E16=\"OVER INCOME\",+'MCC Comparison Summary'!E16,\" \")","v":" "}]
["INTRODUCTION"]
["The City of Portland Mortgage Credit Certificate (MCC) program allows eligible buyers to claim 20 percent of their first mortgage interest as a dollar-for-dollar tax credit versus a traditional tax deduction.  An MCC can increase the amount of a mortgage for which a borrower will qualify. If you expect to pay federal income tax (either through payroll deductions or directly at the end of the year) the MCC may provide a greater savings than other mortgage programs. To participate in the MCC program you must:"]
[]
["· ","Have an annual income at or below $73,000 for a family of one or two, or $83,950 for a family of three or more; and"]
["· ","Purchase a home in the City of Portland with financing from Portland Housing Bureau (PHB) participating lender; and"]
["· ","Be a first-time homebuyer, which Internal Revenue Service defines as not having owned a home in the past three years."]
["· ","If awarded an MCC, you must file IRS form 8296 with your federal income tax return each year during term of the loan."]
[]
["PRODUCT COMPARISON  "]
["You have many options when selecting financing to purchase your first home. This section compares three different financing options including the Oregon Bond, a traditional market rate mortgage and that same market rate loan combined with an MCC."]
[]
{"$rows_left_out":128}
{"sheet":"MCC Transmittal","index":7,"n_rows":49,"n_cols":11,"rows_kept":49,"cut":false,"hidden":false,"merged":[[42,0,42,11],[5,10,5,11],[9,9,9,11],[10,9,10,11],[5,2,5,5],[6,2,6,5],[7,2,7,5],[9,2,9,5],[7,0,7,1],[16,8,17,11],[26,4,26,11],[28,4,28,11],[10,2,10,5],[15,2,15,5],[16,2,16,5],[6,10,6,11],[1,7,1,11],[3,0,3,11],[20,0,20,11],[5,7,5,9],[11,9,11,11],[12,2,12,5],[13,2,13,5],[11,2,11,5],[12,9,12,11],[13,9,13,11]]}
[]
[null,null,null,null,null,null,null,{"$f":"IF('MCC Comparison Summary'!E16=\"OVER INCOME\",\"OVER INCOME\",\" \")","v":" "}]
[]
["MCC INITIAL APPLICATION TRANSMITTAL FORM"]
[]
[{"$f":"'MCC Data Input'!A7","v":"Disclosure Date"},null,{"$f":"'MCC Data Input'!E7","v":"00:00:00"},null,null,null,null,{"$f":"'MCC Data Input'!A130","v":"Escrow Number"},null,null,{"$f":"+'MCC Data Input'!E130","v":0}]
[{"$f":"'MCC Data Input'!A9","v":"Loan Number"},null,{"$f":"'MCC Data Input'!E9","v":0},null,null,null,null,{"$f":"'MCC Data Input'!A131","v":"Estimated Closing Date"},null,null,{"$f":"'MCC Data Input'!E131","v":"00:00:00"}]
["Loan Amount",null,{"$f":"'MCC Comparison Summary'!E22","v":0}]
[]
["Lender Name",null,{"$f":"'MCC Data Input'!E8","v":0},null,null,null,null,{"$f":"+'MCC Data Input'!A129","v":"Escrow Company"},null,{"$f":"'MCC Data Input'!E129","v":0}]
[{"$f":"'MCC Data Input'!A10","v":"Loan Officer"},null,{"$f":"'MCC Data Input'!E10","v":0},null,null,null,null,{"$f":"'MCC Data Input'!A132","v":"Escrow Agent"},null,{"$f":"'MCC Data Input'!E132","v":0}]
[{"$f":"'MCC Data Input'!H11","v":"Business Phone"},null,{"$f":"'MCC Data Input'!E11","v":0},null,null,null,null,{"$f":"A12","v":"Business Phone"},null,{"$f":"'MCC Data Input'!E133","v":0}]
[{"$f":"'MCC Data Input'!H13","v":"Fax Number"},null,{"$f":"'MCC Data Input'!E13","v":0},null,null,null,null,{"$f":"A13","v":"Fax Number"},null,{"$f":"'MCC Data Input'!E134","v":0}]
[{"$f":"'MCC Data Input'!H14","v":"Email Address"},null,{"$f":"'MCC Data Input'!E14","v":0},null,null,null,null,{"$f":"A14","v":"Email Address"},null,{"$f":"'MCC Data Input'!E135","v":0}]
[]
["Applicant Name",null,{"$f":"'MCC Data Input'!E27","v":0}]
["Co-Applicant Name",null,{"$f":"IF('MCC Data Input'!E28=0,\"None\",+'MCC Data Input'!E28)","v":"None"},null,null,null,null,null,"Information can be submitted via Fax or Email to 503-865-3480 or mcc@portlandoregon.gov"]
[{"$f":"'MCC Data Input'!B39","v":"Property Address"},null,{"$f":"'MCC Data Input'!E39","v":0}]
[null,null,{"$f":"'MCC Data Input'!E40","v":0}]
[]
{"$rows_left_out":30}
{"sheet":"MCC Recapture Notice","index":8,"n_rows":35,"n_cols":10,"rows_kept":35,"cut":false,"hidden":false,"merged":[[0,6,0,9],[4,5,6,8],[24,0,24,9],[26,0,26,9],[11,3,11,5],[9,3,9,5],[16,0,16,9],[17,0,17,9],[20,0,20,9],[22,0,22,9]]}
["MAILING ADDRESS",null,null,null,null,null,"MCC NO: _____________________________"]
["Portland Housing Bureau"]
["421 SW 6th Avenue, Suite 500"]
["Portland, OR  97204"]
["TEL: 503-823-2375  FAX: 503-865-3480",null,null,null,null,{"$f":"IF('MCC Comparison Summary'!E16=\"OVER INCOME\",\"OVER INCOME\",\" \")","v":" "}]
["EMAIL:  mcc@portlandoregon.gov"]
[]
[]
[]
["Applicant Name:",null,null,{"$f":"'MCC Data Input'!E27","v":0}]
[]
["Co-Applicant Name:",null,null,{"$f":"IF('MCC Data Input'!E28=0,\" \",+'MCC Data Input'!E28)","v":" "}]
[]
[]
[]
[]
["NOTICE OF POTENTIAL RECAPTURE TAX ON SALE OF HOME"]
["(To be delivered to and signed by the Applicant(s) before a MCC commitment can be issued.)"]
[]
[]
{"$rows_left_out":16}
{"sheet":"MCC Application Affidavit","index":9,"n_rows":170,"n_cols":10,"rows_kept":170,"cut":false,"hidden":false,"merged":[[160,1,160,9],[162,1,162,9],[158,0,158,9],[169,0,169,6],[8,0,8,9],[10,0,10,9],[11,0,11,9],[13,0,13,9],[152,0,152,9],[141,0,141,9],[143,0,143,9],[131,0,131,9],[58,1,58,3],[58,5,58,6],[58,8,58,9],[60,1,60,3],[32,1,32,9],[43,1,43,9],[45,1,45,9],[47,1,47,9],[49,1,49,9],[51,1,51,9],[66,5,66,6],[69,5,69,6],[69,8,69,9],[71,5,71,6],[52,1,52,9],[54,1,54,9],[56,1,56,9],[59,5,59,6],[59,8,59,9],[61,5,61,6],[60,5,60,6],[63,1,63,3],[63,5,63,6],[63,8,63,9],[65,1,65,3],[65,5,65,6],[64,5,64,6],[64,8,64,9],[73,1,73,9],[80,1,80,3],[68,1,68,3],[68,5,68,6],[68,8,68,9],[70,1,70,3],[70,5,70,6],[102,1,102,9],[75,5,75,8],[77,5,77,8],[80,5,80,8],[90,1,90,9],[82,1,82,3],[85,1,85,3],[87,1,87,3],[75,1,75,3],[77,1,77,3],[94,1,94,9],[101,6,101,9],[3,5,4,8],[156,0,156,9],[166,0,166,3],[97,4,97,6],[119,2,119,3],[120,2,120,3],[82,5,82,8],[87,5,87,8],[85,5,85,8],[116,1,116,9],[118,2,118,3],[118,4,118,5],[96,4,96,6],[108,1,108,9],[135,0,135,3],[139,0,139,3],[29,5,29,6],[130,1,130,9],[119,4,119,5],[120,4,120,5],[124,2,124,3],[128,1,128,9],[40,1,40,6],[99,1,99,9],[93,2,93,3],[104,2,104,3],[92,1,92,9],[96,1,96,3],[97,1,97,3],[114,1,114,9],[110,1,110,9],[112,1,112,9]]}
["MAILING ADDRESS",null,null,null,null,null,null,null,null,"MCC NO: _______________________"]
["Portland Housing Bureau"]
["421 SW 6th Avenue, Suite 500"]
["Portland, OR  97204",null,null,null,null,{"$f":"IF('MCC Comparison Summary'!E16=\"OVER INCOME\",\"OVER INCOME\",\" \")","v":" "}]
["Phone - 503-823-2375  Fax 503-865-3480"]
["Email:  mcc@portlandoregon.gov"]
[]
[]
["APPLICATION AFFIDAVIT"]
[]
["THERE ARE IMPORTANT LEGAL CONSEQUENCES TO THIS LEGAL AFFIDAVIT."]
["READ IT CAREFULLY BEFORE SIGNING"]
[]
["I (We) the undersigned, as part of my (our) application for a mortgage credit certificate (\"MCC\") from the City of Portland through the Portland Housing Bureau (\"PHB”), issuer of such certificates under the PHB’s Mortgage Credit Certificate Program (the \"Program\"), and as a material inducement to the PHB  to issue such certificate to the undersigned in connection with the financing with a mortgage loan (the \"Mortgage Loan\") from a lender of the undersigned's choosing (the \"Lender\"), for the undersigned's purchase of a single-family home (the \"Residence\"), being first duly sworn, state the following:"]
[]
["1.","I (We) certify that the following are:"]
[]
[null,"a.",{"$f":"'MCC Data Input'!E27","v":0}]
[null,null,"Applicant"]
[]
{"$rows_left_out":151}
{"sheet":"Sheet1","index":10,"n_rows":0,"n_cols":0,"rows_kept":0,"cut":false,"hidden":false,"merged":[]}